aerialway,0
aeroway,0
amenity,294
barrier,3
boundary,36
building,511
craft,3
emergency,0
geological,0
healthcare,5
highway,996
historic,8
landuse,49
leisure,46
man_made,2
military,0
natural,25
office,5
place,30
power,0
public transport,0
railway,110
route,0
shop,76
sport,3
telecom,0
tourism,46
water,7
waterway,17
