aerialway,0
aeroway,0
amenity,4
barrier,2
boundary,0
building,16
craft,0
emergency,0
geological,0
healthcare,0
highway,260
historic,0
landuse,17
leisure,13
man_made,0
military,0
natural,2
office,0
place,1
power,0
public transport,0
railway,16
route,0
shop,0
sport,2
telecom,0
tourism,1
water,1
waterway,0
