aerialway,0
aeroway,0
amenity,185
barrier,43
boundary,39
building,3261
craft,0
emergency,1
geological,0
healthcare,14
highway,1417
historic,3
landuse,199
leisure,82
man_made,7
military,2
natural,30
office,40
place,67
power,7
public transport,0
railway,5
route,0
shop,23
sport,56
telecom,0
tourism,22
water,9
waterway,3
