aerialway,0
aeroway,0
amenity,42
barrier,26
boundary,0
building,1323
craft,0
emergency,10
geological,0
healthcare,0
highway,240
historic,0
landuse,2
leisure,11
man_made,1
military,0
natural,0
office,0
place,2
power,5
public transport,0
railway,132
route,0
shop,3
sport,7
telecom,0
tourism,2
water,0
waterway,0
