aerialway,0
aeroway,0
amenity,204
barrier,127
boundary,0
building,943
craft,0
emergency,57
geological,0
healthcare,2
highway,1559
historic,5
landuse,139
leisure,170
man_made,9
military,0
natural,141
office,2
place,4
power,0
public transport,0
railway,0
route,0
shop,5
sport,6
telecom,0
tourism,8
water,0
waterway,0
