aerialway,0
aeroway,6
amenity,538
barrier,219
boundary,0
building,2910
craft,4
emergency,11
geological,0
healthcare,11
highway,4756
historic,5
landuse,136
leisure,135
man_made,19
military,0
natural,42
office,16
place,4
power,45
public transport,0
railway,288
route,3
shop,98
sport,34
telecom,0
tourism,35
water,2
waterway,0
