aerialway,0
aeroway,0
amenity,30
barrier,6
boundary,70
building,563
craft,0
emergency,0
geological,0
healthcare,3
highway,966
historic,0
landuse,93
leisure,14
man_made,1
military,0
natural,21
office,3
place,1
power,0
public transport,0
railway,0
route,0
shop,5
sport,0
telecom,0
tourism,2
water,0
waterway,68
