aerialway,0
aeroway,0
amenity,31
barrier,0
boundary,23
building,199
craft,0
emergency,2
geological,0
healthcare,3
highway,411
historic,1
landuse,76
leisure,18
man_made,4
military,0
natural,3
office,7
place,8
power,1
public transport,0
railway,51
route,0
shop,5
sport,11
telecom,0
tourism,3
water,3
waterway,7
