aerialway,0
aeroway,0
amenity,978
barrier,75
boundary,22
building,3827
craft,12
emergency,39
geological,0
healthcare,56
highway,2981
historic,3
landuse,54
leisure,88
man_made,31
military,1
natural,133
office,119
place,9
power,1
public transport,0
railway,188
route,0
shop,373
sport,33
telecom,0
tourism,107
water,0
waterway,0
