aerialway,0
aeroway,1
amenity,320
barrier,355
boundary,198
building,19641
craft,0
emergency,2
geological,0
healthcare,4
highway,3556
historic,2
landuse,27
leisure,26
man_made,21
military,0
natural,46
office,18
place,14
power,9
public transport,0
railway,5
route,5
shop,14
sport,6
telecom,0
tourism,20
water,2
waterway,29
