aerialway,0
aeroway,0
amenity,143
barrier,52
boundary,12
building,562
craft,0
emergency,0
geological,0
healthcare,5
highway,786
historic,4
landuse,345
leisure,102
man_made,7
military,0
natural,147
office,20
place,14
power,0
public transport,0
railway,41
route,0
shop,11
sport,41
telecom,0
tourism,10
water,8
waterway,2
