aerialway,0
aeroway,0
amenity,26
barrier,9
boundary,6
building,35
craft,1
emergency,0
geological,0
healthcare,3
highway,480
historic,0
landuse,73
leisure,15
man_made,0
military,1
natural,8
office,0
place,22
power,18
public transport,0
railway,10
route,0
shop,16
sport,2
telecom,0
tourism,1
water,1
waterway,8
