aerialway,0
aeroway,4
amenity,4
barrier,8
boundary,0
building,26
craft,0
emergency,0
geological,0
healthcare,0
highway,38
historic,0
landuse,2
leisure,0
man_made,0
military,1
natural,0
office,0
place,0
power,0
public transport,0
railway,0
route,0
shop,0
sport,0
telecom,0
tourism,0
water,0
waterway,0
