aerialway,0
aeroway,0
amenity,15
barrier,0
boundary,18
building,3
craft,0
emergency,0
geological,0
healthcare,3
highway,190
historic,0
landuse,2
leisure,8
man_made,0
military,0
natural,5
office,0
place,7
power,51
public transport,0
railway,46
route,0
shop,0
sport,3
telecom,0
tourism,1
water,3
waterway,3
