aerialway,0
aeroway,0
amenity,119
barrier,142
boundary,1
building,303
craft,0
emergency,1
geological,0
healthcare,3
highway,2728
historic,0
landuse,225
leisure,45
man_made,7
military,0
natural,55
office,0
place,0
power,42
public transport,0
railway,0
route,0
shop,10
sport,30
telecom,0
tourism,1
water,3
waterway,19
