aerialway,0
aeroway,0
amenity,540
barrier,29
boundary,4
building,8035
craft,1
emergency,174
geological,0
healthcare,7
highway,2843
historic,1
landuse,520
leisure,203
man_made,26
military,0
natural,181
office,23
place,4
power,10
public transport,0
railway,4
route,0
shop,45
sport,88
telecom,0
tourism,11
water,1
waterway,61
