aerialway,0
aeroway,0
amenity,53
barrier,0
boundary,3
building,553
craft,0
emergency,0
geological,0
healthcare,2
highway,242
historic,4
landuse,60
leisure,45
man_made,1
military,0
natural,7
office,0
place,7
power,6
public transport,0
railway,0
route,0
shop,0
sport,40
telecom,0
tourism,4
water,5
waterway,1
