aerialway,0
aeroway,2
amenity,1
barrier,1
boundary,13
building,49
craft,0
emergency,0
geological,0
healthcare,0
highway,209
historic,0
landuse,23
leisure,12
man_made,8
military,0
natural,3
office,0
place,4
power,0
public transport,0
railway,0
route,0
shop,0
sport,8
telecom,0
tourism,1
water,2
waterway,4
