aerialway,0
aeroway,6
amenity,713
barrier,93
boundary,91
building,3686
craft,3
emergency,13
geological,0
healthcare,34
highway,3568
historic,43
landuse,137
leisure,128
man_made,25
military,1
natural,400
office,85
place,46
power,1
public transport,0
railway,255
route,4
shop,218
sport,75
telecom,0
tourism,132
water,15
waterway,25
