aerialway,0
aeroway,0
amenity,27
barrier,0
boundary,59
building,181
craft,0
emergency,2
geological,0
healthcare,2
highway,239
historic,16
landuse,2
leisure,5
man_made,0
military,0
natural,2
office,1
place,14
power,0
public transport,0
railway,259
route,0
shop,2
sport,1
telecom,0
tourism,3
water,2
waterway,2
