aerialway,0
aeroway,0
amenity,853
barrier,623
boundary,793
building,51315
craft,4
emergency,4
geological,0
healthcare,4
highway,3215
historic,13
landuse,37
leisure,83
man_made,183
military,0
natural,19
office,138
place,31
power,68
public transport,0
railway,115
route,0
shop,390
sport,56
telecom,0
tourism,41
water,14
waterway,43
