aerialway,0
aeroway,0
amenity,489
barrier,44
boundary,132
building,2103
craft,4
emergency,11
geological,0
healthcare,53
highway,3852
historic,5
landuse,95
leisure,54
man_made,6
military,1
natural,324
office,60
place,92
power,0
public transport,0
railway,128
route,0
shop,171
sport,10
telecom,0
tourism,131
water,3
waterway,0
