aerialway,0
aeroway,165
amenity,148
barrier,34
boundary,0
building,326
craft,1
emergency,3
geological,0
healthcare,5
highway,1174
historic,2
landuse,60
leisure,43
man_made,19
military,0
natural,13
office,15
place,4
power,0
public transport,0
railway,16
route,0
shop,22
sport,14
telecom,0
tourism,32
water,0
waterway,2
