aerialway,0
aeroway,13
amenity,355
barrier,199
boundary,40
building,1815
craft,0
emergency,1
geological,0
healthcare,9
highway,4149
historic,1
landuse,265
leisure,156
man_made,20
military,2
natural,84
office,25
place,37
power,0
public transport,0
railway,250
route,0
shop,57
sport,64
telecom,0
tourism,42
water,20
waterway,27
