aerialway,0
aeroway,0
amenity,40
barrier,30
boundary,29
building,1983
craft,0
emergency,0
geological,0
healthcare,0
highway,643
historic,1
landuse,127
leisure,18
man_made,2
military,0
natural,8
office,5
place,2
power,0
public transport,0
railway,50
route,0
shop,12
sport,7
telecom,0
tourism,0
water,6
waterway,15
