aerialway,0
aeroway,0
amenity,188
barrier,6
boundary,18
building,95
craft,2
emergency,2
geological,0
healthcare,3
highway,1299
historic,1
landuse,18
leisure,31
man_made,7
military,0
natural,26
office,6
place,13
power,16
public transport,0
railway,6
route,0
shop,80
sport,6
telecom,0
tourism,21
water,0
waterway,10
