aerialway,0
aeroway,2
amenity,580
barrier,321
boundary,9
building,14505
craft,3
emergency,21
geological,0
healthcare,16
highway,6097
historic,29
landuse,182
leisure,283
man_made,52
military,0
natural,123
office,28
place,20
power,2
public transport,0
railway,275
route,0
shop,48
sport,84
telecom,0
tourism,45
water,0
waterway,3
