aerialway,0
aeroway,10
amenity,1575
barrier,230
boundary,22
building,8959
craft,13
emergency,13
geological,0
healthcare,13
highway,12082
historic,19
landuse,332
leisure,126
man_made,19
military,1
natural,4106
office,44
place,16
power,50
public transport,0
railway,267
route,0
shop,80
sport,29
telecom,0
tourism,62
water,4
waterway,6
