aerialway,0
aeroway,0
amenity,15
barrier,0
boundary,15
building,16
craft,0
emergency,0
geological,0
healthcare,1
highway,201
historic,0
landuse,5
leisure,5
man_made,0
military,0
natural,7
office,0
place,12
power,6
public transport,0
railway,83
route,0
shop,2
sport,0
telecom,0
tourism,1
water,3
waterway,3
