aerialway,0
aeroway,4
amenity,4155
barrier,326
boundary,121
building,20799
craft,339
emergency,86
geological,0
healthcare,353
highway,3997
historic,101
landuse,173
leisure,182
man_made,83
military,1
natural,225
office,381
place,73
power,2
public transport,0
railway,448
route,28
shop,4597
sport,18
telecom,0
tourism,1269
water,1
waterway,7
