aerialway,22
aeroway,1
amenity,9321
barrier,1499
boundary,46
building,12438
craft,34
emergency,204
geological,0
healthcare,195
highway,18561
historic,167
landuse,799
leisure,617
man_made,146
military,1
natural,6172
office,550
place,78
power,114
public transport,0
railway,613
route,30
shop,2063
sport,130
telecom,0
tourism,999
water,30
waterway,12
