aerialway,1
aeroway,0
amenity,62
barrier,5
boundary,12
building,98
craft,0
emergency,0
geological,0
healthcare,1
highway,1011
historic,0
landuse,43
leisure,75
man_made,11
military,0
natural,46
office,1
place,7
power,58
public transport,0
railway,42
route,5
shop,17
sport,54
telecom,0
tourism,11
water,3
waterway,15
