aerialway,0
aeroway,0
amenity,13
barrier,16
boundary,0
building,9
craft,0
emergency,0
geological,0
healthcare,0
highway,178
historic,0
landuse,598
leisure,0
man_made,1
military,0
natural,1
office,0
place,0
power,0
public transport,0
railway,0
route,0
shop,4
sport,0
telecom,0
tourism,5
water,0
waterway,3
