aerialway,0
aeroway,0
amenity,48
barrier,1
boundary,4
building,438
craft,0
emergency,1
geological,0
healthcare,2
highway,780
historic,1
landuse,39
leisure,28
man_made,3
military,0
natural,23
office,4
place,6
power,0
public transport,0
railway,0
route,0
shop,8
sport,1
telecom,0
tourism,2
water,20
waterway,20
