aerialway,0
aeroway,0
amenity,433
barrier,67
boundary,4
building,12264
craft,4
emergency,4
geological,0
healthcare,23
highway,2280
historic,14
landuse,38
leisure,143
man_made,8
military,0
natural,648
office,447
place,20
power,1
public transport,0
railway,56
route,0
shop,195
sport,51
telecom,0
tourism,39
water,5
waterway,35
