aerialway,0
aeroway,2
amenity,235
barrier,4
boundary,1
building,33217
craft,1
emergency,5
geological,0
healthcare,0
highway,1419
historic,9
landuse,14
leisure,39
man_made,20
military,0
natural,149
office,34
place,8
power,2
public transport,0
railway,77
route,0
shop,82
sport,8
telecom,0
tourism,27
water,66
waterway,47
