aerialway,0
aeroway,0
amenity,5
barrier,0
boundary,40
building,35
craft,0
emergency,0
geological,0
healthcare,1
highway,100
historic,0
landuse,9
leisure,0
man_made,4
military,0
natural,0
office,0
place,6
power,0
public transport,0
railway,81
route,0
shop,1
sport,0
telecom,0
tourism,0
water,0
waterway,1
