aerialway,0
aeroway,4
amenity,86
barrier,0
boundary,2
building,42
craft,6
emergency,0
geological,0
healthcare,2
highway,758
historic,1
landuse,29
leisure,5
man_made,4
military,0
natural,2
office,15
place,3
power,0
public transport,0
railway,1
route,0
shop,30
sport,0
telecom,0
tourism,11
water,0
waterway,4
