aerialway,0
aeroway,2
amenity,413
barrier,203
boundary,20
building,470
craft,2
emergency,5
geological,0
healthcare,59
highway,3009
historic,1
landuse,78
leisure,122
man_made,47
military,0
natural,26
office,39
place,17
power,223
public transport,0
railway,0
route,0
shop,247
sport,24
telecom,0
tourism,89
water,4
waterway,60
