aerialway,0
aeroway,4
amenity,162
barrier,443
boundary,12
building,5235
craft,0
emergency,0
geological,0
healthcare,12
highway,1146
historic,1
landuse,118
leisure,70
man_made,38
military,1
natural,24
office,21
place,4
power,13
public transport,0
railway,2
route,3
shop,5
sport,37
telecom,0
tourism,9
water,4
waterway,56
