aerialway,0
aeroway,2
amenity,1927
barrier,324
boundary,11
building,6839
craft,3
emergency,2
geological,0
healthcare,79
highway,5853
historic,40
landuse,677
leisure,118
man_made,145
military,0
natural,611
office,134
place,118
power,71
public transport,0
railway,522
route,22
shop,546
sport,25
telecom,0
tourism,162
water,65
waterway,159
