aerialway,0
aeroway,0
amenity,52
barrier,3
boundary,0
building,1455
craft,0
emergency,0
geological,0
healthcare,0
highway,501
historic,1
landuse,22
leisure,56
man_made,0
military,0
natural,51
office,1
place,8
power,0
public transport,0
railway,15
route,0
shop,26
sport,38
telecom,0
tourism,5
water,3
waterway,18
