aerialway,0
aeroway,0
amenity,249
barrier,500
boundary,4
building,7634
craft,0
emergency,0
geological,0
healthcare,3
highway,3793
historic,2
landuse,57
leisure,181
man_made,22
military,0
natural,63
office,18
place,1
power,3
public transport,0
railway,170
route,0
shop,19
sport,32
telecom,0
tourism,18
water,22
waterway,74
