aerialway,0
aeroway,0
amenity,78
barrier,10
boundary,13
building,20353
craft,0
emergency,1
geological,0
healthcare,14
highway,1146
historic,0
landuse,54
leisure,7
man_made,1
military,0
natural,5
office,0
place,0
power,0
public transport,0
railway,0
route,0
shop,0
sport,0
telecom,0
tourism,4
water,2
waterway,36
