aerialway,0
aeroway,0
amenity,531
barrier,289
boundary,12
building,12771
craft,5
emergency,5
geological,0
healthcare,13
highway,2722
historic,27
landuse,159
leisure,32
man_made,9
military,1
natural,99
office,52
place,28
power,1
public transport,0
railway,5
route,0
shop,202
sport,9
telecom,0
tourism,123
water,1
waterway,0
