aerialway,0
aeroway,0
amenity,149
barrier,152
boundary,0
building,11286
craft,3
emergency,0
geological,0
healthcare,4
highway,2416
historic,0
landuse,21
leisure,35
man_made,5
military,0
natural,7
office,2
place,2
power,215
public transport,0
railway,31
route,0
shop,33
sport,20
telecom,0
tourism,1
water,2
waterway,1
