aerialway,0
aeroway,0
amenity,13
barrier,0
boundary,45
building,19
craft,0
emergency,0
geological,0
healthcare,3
highway,167
historic,0
landuse,3
leisure,5
man_made,5
military,0
natural,7
office,0
place,13
power,0
public transport,0
railway,56
route,0
shop,6
sport,2
telecom,0
tourism,3
water,7
waterway,4
