aerialway,0
aeroway,6
amenity,630
barrier,1036
boundary,2
building,8762
craft,4
emergency,7
geological,0
healthcare,20
highway,5665
historic,6
landuse,71
leisure,98
man_made,19
military,0
natural,65
office,18
place,6
power,182
public transport,0
railway,353
route,1
shop,55
sport,33
telecom,1
tourism,58
water,2
waterway,18
