aerialway,0
aeroway,1
amenity,37
barrier,48
boundary,7
building,26356
craft,0
emergency,0
geological,0
healthcare,0
highway,2253
historic,0
landuse,20
leisure,5
man_made,27
military,0
natural,1
office,2
place,4
power,6
public transport,0
railway,8
route,0
shop,6
sport,2
telecom,0
tourism,1
water,1
waterway,4
