aerialway,0
aeroway,0
amenity,59
barrier,1
boundary,19
building,25
craft,0
emergency,0
geological,0
healthcare,10
highway,330
historic,1
landuse,10
leisure,4
man_made,2
military,5
natural,2
office,5
place,10
power,0
public transport,0
railway,55
route,0
shop,5
sport,1
telecom,0
tourism,7
water,0
waterway,0
