aerialway,0
aeroway,1
amenity,21
barrier,0
boundary,6
building,79
craft,0
emergency,0
geological,0
healthcare,0
highway,463
historic,0
landuse,53
leisure,44
man_made,0
military,0
natural,9
office,4
place,6
power,1
public transport,0
railway,0
route,0
shop,8
sport,28
telecom,0
tourism,5
water,0
waterway,1
