aerialway,0
aeroway,1
amenity,718
barrier,179
boundary,327
building,49323
craft,5
emergency,10
geological,0
healthcare,36
highway,2885
historic,8
landuse,1737
leisure,54
man_made,46
military,0
natural,59
office,93
place,136
power,19
public transport,0
railway,61
route,0
shop,267
sport,27
telecom,0
tourism,48
water,13
waterway,95
