aerialway,0
aeroway,2
amenity,3468
barrier,1331
boundary,35
building,21750
craft,50
emergency,4
geological,0
healthcare,91
highway,2893
historic,7
landuse,740
leisure,169
man_made,49
military,0
natural,3379
office,262
place,194
power,40
public transport,0
railway,79
route,1
shop,1046
sport,61
telecom,0
tourism,95
water,11
waterway,128
