aerialway,0
aeroway,1
amenity,50
barrier,6
boundary,16
building,216
craft,0
emergency,1
geological,0
healthcare,1
highway,738
historic,6
landuse,57
leisure,29
man_made,4
military,0
natural,46
office,3
place,36
power,0
public transport,0
railway,40
route,0
shop,3
sport,18
telecom,0
tourism,9
water,4
waterway,10
