aerialway,0
aeroway,1
amenity,433
barrier,83
boundary,77
building,8480
craft,0
emergency,1
geological,0
healthcare,77
highway,1740
historic,18
landuse,220
leisure,52
man_made,20
military,0
natural,45
office,26
place,43
power,1
public transport,0
railway,379
route,0
shop,54
sport,11
telecom,1
tourism,58
water,10
waterway,13
