aerialway,0
aeroway,4
amenity,6176
barrier,3327
boundary,117
building,10251
craft,30
emergency,607
geological,0
healthcare,127
highway,15094
historic,394
landuse,1488
leisure,726
man_made,4092
military,2
natural,9902
office,624
place,86
power,153
public transport,0
railway,2125
route,0
shop,1402
sport,290
telecom,8
tourism,811
water,48
waterway,52
