aerialway,0
aeroway,1
amenity,519
barrier,338
boundary,3
building,4609
craft,1
emergency,3
geological,0
healthcare,14
highway,2971
historic,18
landuse,54
leisure,206
man_made,13
military,0
natural,145
office,21
place,18
power,1
public transport,0
railway,0
route,0
shop,117
sport,41
telecom,0
tourism,57
water,6
waterway,3
