aerialway,0
aeroway,0
amenity,5
barrier,0
boundary,0
building,37
craft,0
emergency,0
geological,0
healthcare,0
highway,110
historic,0
landuse,28
leisure,0
man_made,0
military,0
natural,48
office,0
place,0
power,0
public transport,0
railway,42
route,0
shop,0
sport,0
telecom,0
tourism,0
water,0
waterway,0
