370630020072	370630020211	1
370630020072	370630020231	1
370630020072	370630020241	1
370630020072	370630020242	1
370630020072	370630020081	1
370630020072	370630020082	1
370630020072	370630020073	1
370630020072	370630020093	1
370630020072	370630020071	1
370630020072	370630020183	1
370630003013	370630004021	1
370630003013	370630003023	1
370630003013	370630003022	1
370630003013	370630003012	1
370630003013	370630015031	1
370630021003	370630016034	1
370630021003	370630021001	1
370630021003	370630021002	1
370630015022	370630015021	1
370630015022	370630015011	1
370630015022	370630015023	1
370630019002	370630019001	1
370630019002	370630018061	1
370630019001	370630019002	1
370630019001	370630018092	1
370630019001	370630018061	1
370630019001	370630018082	1
370630007001	370630023001	1
370630007001	370630007002	1
370630007001	370630005002	1
370630007001	370630005003	1
370630007001	370630005004	1
370630007001	370630022001	1
370630016011	370630016034	1
370630016011	370630016013	1
370630016011	370630017093	1
370630016011	370630021001	1
370630016011	370630016012	1
370630016011	370630018015	1
370630016041	370630016043	1
370630016041	370630016032	1
370630016041	370630016031	1
370630016041	370630017071	1
370630016041	370630016042	1
370630016041	370630017074	1
370630020182	370630020082	1
370630020182	370630020161	1
370630020182	370630020181	1
370630020182	370630020173	1
370630020182	370630020183	1
370630017072	370630017073	1
370630017072	370630017071	1
370630017072	370630017061	1
370630017072	370630004021	1
370630017072	370630004013	1
370630017072	370630017052	1
370630017072	370630017062	1
370630017072	370630017074	1
370630018011	370630018012	1
370630018011	370630018014	1
370630018011	370630018015	1
370630018011	370630018061	1
370630018011	370630018062	1
370630018011	370630018021	1
370630017081	370630017093	1
370630017081	370630017101	1
370630017081	370630016012	1
370630020211	370630020072	1
370630020211	370630020212	1
370630020211	370630020231	1
370630020211	370630020232	1
370630020211	370630020202	1
370630020211	370630020191	1
370630020211	370630020201	1
370630020212	370630020211	1
370630020212	370630020221	1
370630020212	370630020273	1
370630020212	370630020131	1
370630020212	370630020202	1
370630020221	370630020212	1
370630020221	370630020222	1
370630020221	370630020232	1
370630020221	370630020272	1
370630020222	370630020221	1
370630020222	370630020232	1
370630020222	370630020241	1
370630020222	370630020251	1
370630020222	370630020252	1
370630020222	370630020272	1
370630020231	370630020072	1
370630020231	370630020211	1
370630020231	370630020232	1
370630020231	370630020242	1
370630016043	370630016041	1
370630016043	370630016034	1
370630016043	370630016032	1
370630016043	370630016033	1
370630016043	370630016042	1
370630016034	370630021003	1
370630016034	370630016011	1
370630016034	370630016043	1
370630016034	370630021001	1
370630016034	370630016033	1
370630017111	370630017113	1
370630017111	370630016031	1
370630017111	370630017101	1
370630017111	370630017112	1
370630017111	370630017074	1
370630017111	370630017075	1
370630016032	370630016041	1
370630016032	370630016043	1
370630016032	370630016013	1
370630016032	370630016031	1
370630016032	370630017101	1
370630016032	370630016012	1
370630016032	370630016033	1
370630011002	370630014002	1
370630011002	370630011001	1
370630011002	370630023002	1
370630011002	370630010013	1
370630011002	370630010012	1
370630011002	370630022001	1
370630018022	370630018071	1
370630018022	370630018023	1
370630018022	370630018073	1
370630018022	370630018021	1
370630018013	370630018012	1
370630018013	370630017091	1
370630018013	370630001011	1
370630018013	370630018014	1
370630018013	370630017092	1
370630018013	370630002001	1
370630018013	370630018015	1
370630018013	370630001012	1
370630018012	370630018011	1
370630018012	370630018013	1
370630018012	370630018014	1
370630018012	370630010021	1
370630018012	370630018021	1
370630020232	370630020211	1
370630020232	370630020221	1
370630020232	370630020222	1
370630020232	370630020231	1
370630020232	370630020241	1
370630020232	370630020243	1
370630020241	370630020072	1
370630020241	370630020222	1
370630020241	370630020232	1
370630020241	370630020242	1
370630020241	370630020243	1
370630020241	370630020251	1
370630020241	370630020093	1
370630020242	370630020072	1
370630020242	370630020231	1
370630020242	370630020241	1
370630020242	370630020243	1
370630020243	370630020232	1
370630020243	370630020241	1
370630020243	370630020242	1
370630020251	370630020222	1
370630020251	370630020241	1
370630020251	370630020252	1
370630020251	370630020261	1
370630020251	370630020093	1
370630006002	370630020172	1
370630006002	370630005004	1
370630006002	370630006001	1
370630006002	370630006003	1
370630006002	370630020153	1
370630017102	370630017051	1
370630017102	370630017101	1
370630017102	370630017112	1
370630017051	370630017102	1
370630017051	370630017113	1
370630017051	370630017093	1
370630017051	370630017101	1
370630017051	370630017052	1
370630017051	370630017112	1
370630017051	370630017053	1
370630017051	370630001022	1
370630017113	370630017111	1
370630017113	370630017051	1
370630017113	370630017052	1
370630017113	370630017112	1
370630017113	370630017075	1
370630020171	370630020172	1
370630020171	370630017061	1
370630020171	370630006003	1
370630020171	370630020173	1
370630020081	370630020072	1
370630020081	370630020152	1
370630020081	370630020082	1
370630020081	370630020073	1
370630020081	370630020162	1
370630016013	370630016011	1
370630016013	370630016032	1
370630016013	370630016012	1
370630016013	370630016033	1
370630020252	370630020222	1
370630020252	370630020251	1
370630020252	370630020253	1
370630020252	370630020272	1
370630020252	370630020262	1
370630020253	370630020252	1
370630020253	370630020272	1
370630020253	370630020262	1
370630020253	370630020271	1
370630020261	370630020251	1
370630020261	370630020093	1
370630020261	370630020092	1
370630020261	370630020262	1
370630020272	370630020221	1
370630020272	370630020222	1
370630020272	370630020252	1
370630020272	370630020253	1
370630020272	370630020273	1
370630020272	370639801001	1
370630020272	370630020133	1
370630020272	370630020132	1
370630020272	370630020202	1
370630020272	370630020271	1
370630020273	370630020212	1
370630020273	370630020272	1
370630020273	370630020132	1
370630020273	370630020131	1
370630020281	370630020282	1
370630020281	370630020283	1
370630020281	370639801001	1
370630020281	370630018092	1
370630020281	370630018091	1
370630020282	370630020281	1
370630020282	370630020283	1
370630020282	370630018092	1
370630020283	370630020281	1
370630020283	370630020282	1
370630020283	370639801001	1
370630016031	370630016041	1
370630016031	370630017111	1
370630016031	370630016032	1
370630016031	370630017101	1
370630017093	370630016011	1
370630017093	370630017081	1
370630017093	370630017051	1
370630017093	370630017101	1
370630017093	370630017091	1
370630017093	370630017092	1
370630017093	370630018015	1
370630017093	370630001012	1
370630017093	370630001022	1
370630014002	370630011002	1
370630014002	370630023002	1
370630014002	370630010013	1
370630014002	370630014001	1
370630014002	370630013031	1
370630014002	370630013011	1
370630014002	370630020091	1
370630011001	370630011002	1
370630011001	370630009002	1
370630011001	370630009001	1
370630011001	370630010011	1
370630011001	370630010012	1
370630011001	370630022001	1
370630020172	370630006002	1
370630020172	370630020171	1
370630020172	370630006003	1
370630020172	370630020153	1
370630020172	370630020173	1
370630023001	370630007001	1
370630023001	370630023002	1
370630023001	370630007002	1
370630023001	370630013011	1
370630023001	370630022001	1
370630023002	370630011002	1
370630023002	370630014002	1
370630023002	370630023001	1
370630023002	370630013011	1
370639801001	370630020272	1
370639801001	370630020281	1
370639801001	370630020283	1
370639801001	370630020271	1
370639801001	370630018091	1
370630018024	370630018071	1
370630018024	370630010013	1
370630018024	370630018023	1
370630018024	370630010022	1
370630018024	370630020271	1
370630018024	370630018091	1
370630018071	370630018022	1
370630018071	370630018024	1
370630018071	370630018081	1
370630018071	370630018023	1
370630018071	370630018073	1
370630018071	370630018082	1
370630018071	370630018091	1
370630018072	370630018081	1
370630018072	370630018061	1
370630018072	370630018062	1
370630018072	370630018073	1
370630018081	370630018071	1
370630018081	370630018072	1
370630018081	370630018082	1
370630017073	370630017072	1
370630017073	370630017052	1
370630017073	370630017074	1
370630017101	370630017081	1
370630017101	370630017111	1
370630017101	370630016032	1
370630017101	370630017102	1
370630017101	370630017051	1
370630017101	370630016031	1
370630017101	370630017093	1
370630017101	370630017112	1
370630017071	370630016041	1
370630017071	370630017072	1
370630017071	370630017074	1
370630017061	370630017072	1
370630017061	370630020171	1
370630017061	370630015024	1
370630017061	370630017062	1
370630020152	370630020081	1
370630020152	370630020151	1
370630020152	370630020073	1
370630020152	370630020071	1
370630020152	370630020153	1
370630020152	370630020162	1
370630015021	370630015022	1
370630015021	370630004021	1
370630015021	370630005001	1
370630015021	370630015011	1
370630015021	370630015023	1
370630020082	370630020072	1
370630020082	370630020182	1
370630020082	370630020081	1
370630020082	370630020161	1
370630020082	370630020162	1
370630020082	370630020183	1
370630021001	370630021003	1
370630021001	370630016011	1
370630021001	370630016034	1
370630021001	370630021002	1
370630021001	370630018015	1
370630020151	370630020152	1
370630020151	370630020071	1
370630020151	370630006001	1
370630020151	370630020153	1
370630007002	370630007001	1
370630007002	370630023001	1
370630007002	370630007003	1
370630007002	370630013031	1
370630007002	370630013041	1
370630007002	370630013011	1
370630007002	370630005004	1
370630007002	370630006001	1
370630004021	370630003013	1
370630004021	370630017072	1
370630004021	370630015021	1
370630004021	370630005001	1
370630004021	370630004013	1
370630004021	370630003012	1
370630004021	370630015031	1
370630004021	370630015023	1
370630020133	370630020272	1
370630020133	370630020132	1
370630020133	370630020131	1
370630020133	370630020202	1
370630005001	370630015021	1
370630005001	370630004021	1
370630005001	370630005002	1
370630005001	370630015031	1
370630005001	370630015011	1
370630005001	370630006003	1
370630004013	370630017072	1
370630004013	370630004021	1
370630004013	370630004012	1
370630004013	370630004011	1
370630004013	370630003012	1
370630004013	370630017052	1
370630010024	370630009001	1
370630010024	370630010011	1
370630010024	370630010021	1
370630010024	370630010023	1
370630010024	370630010022	1
370630005002	370630007001	1
370630005002	370630005001	1
370630005002	370630005003	1
370630005002	370630015031	1
370630005002	370630022001	1
370630005002	370630006003	1
370630016012	370630016011	1
370630016012	370630017081	1
370630016012	370630016032	1
370630016012	370630016013	1
370630003011	370630004012	1
370630003011	370630001021	1
370630003011	370630003021	1
370630003011	370630004011	1
370630003011	370630003012	1
370630004012	370630004013	1
370630004012	370630003011	1
370630004012	370630004011	1
370630001021	370630003011	1
370630001021	370630003021	1
370630001021	370630002003	1
370630001021	370630001011	1
370630001021	370630017053	1
370630001021	370630001022	1
370630003023	370630003013	1
370630003023	370630003022	1
370630003023	370630002003	1
370630003023	370630015031	1
370630003023	370630022001	1
370630003021	370630003011	1
370630003021	370630001021	1
370630003021	370630003022	1
370630003021	370630003012	1
370630003021	370630002003	1
370630003022	370630003013	1
370630003022	370630003023	1
370630003022	370630003021	1
370630003022	370630002003	1
370630005003	370630007001	1
370630005003	370630005002	1
370630005003	370630005004	1
370630005003	370630006003	1
370630004011	370630004013	1
370630004011	370630003011	1
370630004011	370630004012	1
370630004011	370630017052	1
370630004011	370630017053	1
370630009002	370630011001	1
370630009002	370630009001	1
370630009002	370630022001	1
370630009002	370630002002	1
370630007003	370630007002	1
370630007003	370630013041	1
370630007003	370630020071	1
370630007003	370630006001	1
370630009001	370630011001	1
370630009001	370630010024	1
370630009001	370630009002	1
370630009001	370630010011	1
370630009001	370630010021	1
370630009001	370630002001	1
370630009001	370630002002	1
370630003012	370630003013	1
370630003012	370630004021	1
370630003012	370630004013	1
370630003012	370630003011	1
370630003012	370630003021	1
370630002003	370630001021	1
370630002003	370630003023	1
370630002003	370630003021	1
370630002003	370630003022	1
370630002003	370630002001	1
370630002003	370630022001	1
370630002003	370630002002	1
370630010011	370630011001	1
370630010011	370630010024	1
370630010011	370630009001	1
370630010011	370630010012	1
370630010011	370630010023	1
370630013032	370630013031	1
370630013032	370630013041	1
370630020161	370630020182	1
370630020161	370630020082	1
370630020161	370630020162	1
370630020161	370630020173	1
370630010013	370630011002	1
370630010013	370630014002	1
370630010013	370630018024	1
370630010013	370630010012	1
370630010013	370630010022	1
370630010013	370630020271	1
370630014001	370630014002	1
370630014001	370630013031	1
370630014001	370630020091	1
370630013031	370630014002	1
370630013031	370630007002	1
370630013031	370630013032	1
370630013031	370630014001	1
370630013031	370630013041	1
370630013031	370630013011	1
370630013031	370630020091	1
370630020073	370630020072	1
370630020073	370630020081	1
370630020073	370630020152	1
370630020073	370630020071	1
370630020093	370630020072	1
370630020093	370630020241	1
370630020093	370630020251	1
370630020093	370630020261	1
370630020093	370630013041	1
370630020093	370630020071	1
370630020093	370630020092	1
370630013041	370630007002	1
370630013041	370630007003	1
370630013041	370630013032	1
370630013041	370630013031	1
370630013041	370630020093	1
370630013041	370630020092	1
370630015031	370630003013	1
370630015031	370630004021	1
370630015031	370630005001	1
370630015031	370630005002	1
370630015031	370630003023	1
370630015031	370630022001	1
370630013011	370630014002	1
370630013011	370630023001	1
370630013011	370630023002	1
370630013011	370630007002	1
370630013011	370630013031	1
370630020132	370630020272	1
370630020132	370630020273	1
370630020132	370630020133	1
370630020132	370630020131	1
370630017091	370630018013	1
370630017091	370630017093	1
370630017091	370630017092	1
370630020071	370630020072	1
370630020071	370630020152	1
370630020071	370630020151	1
370630020071	370630007003	1
370630020071	370630020073	1
370630020071	370630020093	1
370630015011	370630015022	1
370630015011	370630015021	1
370630015011	370630005001	1
370630015011	370630006003	1
370630015011	370630015023	1
370630015011	370630015024	1
370630010012	370630011002	1
370630010012	370630011001	1
370630010012	370630010011	1
370630010012	370630010013	1
370630010012	370630010023	1
370630010012	370630010022	1
370630001011	370630018013	1
370630001011	370630001021	1
370630001011	370630002001	1
370630001011	370630001012	1
370630001011	370630001022	1
370630018014	370630018011	1
370630018014	370630018013	1
370630018014	370630018012	1
370630018014	370630018015	1
370630010021	370630018012	1
370630010021	370630010024	1
370630010021	370630009001	1
370630010021	370630010022	1
370630010021	370630002001	1
370630010021	370630018021	1
370630018023	370630018022	1
370630018023	370630018024	1
370630018023	370630018071	1
370630018023	370630010022	1
370630018023	370630018021	1
370630010023	370630010024	1
370630010023	370630010011	1
370630010023	370630010012	1
370630010023	370630010022	1
370630010022	370630018024	1
370630010022	370630010024	1
370630010022	370630010013	1
370630010022	370630010012	1
370630010022	370630010021	1
370630010022	370630018023	1
370630010022	370630010023	1
370630017092	370630018013	1
370630017092	370630017093	1
370630017092	370630017091	1
370630017092	370630001012	1
370630020181	370630020182	1
370630020181	370630020192	1
370630020181	370630020173	1
370630020181	370630020183	1
370630020181	370630020193	1
370630002001	370630018013	1
370630002001	370630009001	1
370630002001	370630002003	1
370630002001	370630001011	1
370630002001	370630010021	1
370630002001	370630002002	1
370630020091	370630014002	1
370630020091	370630014001	1
370630020091	370630013031	1
370630020091	370630020092	1
370630020091	370630020262	1
370630020091	370630020271	1
370630020092	370630020261	1
370630020092	370630020093	1
370630020092	370630013041	1
370630020092	370630020091	1
370630020092	370630020262	1
370630016033	370630016043	1
370630016033	370630016034	1
370630016033	370630016032	1
370630016033	370630016013	1
370630021002	370630021003	1
370630021002	370630021001	1
370630021002	370630018015	1
370630016042	370630016041	1
370630016042	370630016043	1
370630020131	370630020212	1
370630020131	370630020273	1
370630020131	370630020133	1
370630020131	370630020132	1
370630020131	370630020202	1
370630017052	370630017072	1
370630017052	370630017051	1
370630017052	370630017113	1
370630017052	370630017073	1
370630017052	370630004013	1
370630017052	370630004011	1
370630017052	370630017053	1
370630017052	370630017074	1
370630017052	370630017075	1
370630018015	370630016011	1
370630018015	370630018011	1
370630018015	370630018013	1
370630018015	370630017093	1
370630018015	370630021001	1
370630018015	370630018014	1
370630018015	370630021002	1
370630018015	370630018061	1
370630017112	370630017111	1
370630017112	370630017102	1
370630017112	370630017051	1
370630017112	370630017113	1
370630017112	370630017101	1
370630017053	370630017051	1
370630017053	370630001021	1
370630017053	370630004011	1
370630017053	370630017052	1
370630017053	370630001022	1
370630005004	370630007001	1
370630005004	370630006002	1
370630005004	370630007002	1
370630005004	370630005003	1
370630005004	370630006001	1
370630005004	370630006003	1
370630006001	370630006002	1
370630006001	370630020151	1
370630006001	370630007002	1
370630006001	370630007003	1
370630006001	370630005004	1
370630006001	370630020153	1
370630001012	370630018013	1
370630001012	370630017093	1
370630001012	370630001011	1
370630001012	370630017092	1
370630001012	370630001022	1
370630018092	370630019001	1
370630018092	370630020281	1
370630018092	370630020282	1
370630018092	370630018082	1
370630018092	370630018091	1
370630020192	370630020181	1
370630020192	370630020191	1
370630020192	370630020193	1
370630020192	370630020201	1
370630022001	370630007001	1
370630022001	370630011002	1
370630022001	370630011001	1
370630022001	370630023001	1
370630022001	370630005002	1
370630022001	370630003023	1
370630022001	370630009002	1
370630022001	370630002003	1
370630022001	370630015031	1
370630022001	370630002002	1
370630020202	370630020211	1
370630020202	370630020212	1
370630020202	370630020272	1
370630020202	370630020133	1
370630020202	370630020131	1
370630020202	370630020201	1
370630020262	370630020252	1
370630020262	370630020253	1
370630020262	370630020261	1
370630020262	370630020091	1
370630020262	370630020092	1
370630020262	370630020271	1
370630020271	370630020253	1
370630020271	370630020272	1
370630020271	370639801001	1
370630020271	370630018024	1
370630020271	370630010013	1
370630020271	370630020091	1
370630020271	370630020262	1
370630020271	370630018091	1
370630001022	370630017051	1
370630001022	370630017093	1
370630001022	370630001021	1
370630001022	370630001011	1
370630001022	370630017053	1
370630001022	370630001012	1
370630006003	370630006002	1
370630006003	370630020171	1
370630006003	370630020172	1
370630006003	370630005001	1
370630006003	370630005002	1
370630006003	370630005003	1
370630006003	370630015011	1
370630006003	370630005004	1
370630006003	370630015024	1
370630015023	370630015022	1
370630015023	370630015021	1
370630015023	370630004021	1
370630015023	370630015011	1
370630015023	370630015024	1
370630015023	370630017062	1
370630015024	370630017061	1
370630015024	370630015011	1
370630015024	370630006003	1
370630015024	370630015023	1
370630017062	370630017072	1
370630017062	370630017061	1
370630017062	370630015023	1
370630017074	370630016041	1
370630017074	370630017072	1
370630017074	370630017111	1
370630017074	370630017073	1
370630017074	370630017071	1
370630017074	370630017052	1
370630017074	370630017075	1
370630017075	370630017111	1
370630017075	370630017113	1
370630017075	370630017052	1
370630017075	370630017074	1
370630018061	370630019002	1
370630018061	370630019001	1
370630018061	370630018011	1
370630018061	370630018072	1
370630018061	370630018015	1
370630018061	370630018062	1
370630018061	370630018082	1
370630018062	370630018011	1
370630018062	370630018072	1
370630018062	370630018061	1
370630018062	370630018073	1
370630018062	370630018021	1
370630018073	370630018022	1
370630018073	370630018071	1
370630018073	370630018072	1
370630018073	370630018062	1
370630018073	370630018021	1
370630018082	370630019001	1
370630018082	370630018071	1
370630018082	370630018081	1
370630018082	370630018092	1
370630018082	370630018061	1
370630018082	370630018091	1
370630018091	370630020281	1
370630018091	370639801001	1
370630018091	370630018024	1
370630018091	370630018071	1
370630018091	370630018092	1
370630018091	370630020271	1
370630018091	370630018082	1
370630020153	370630006002	1
370630020153	370630020172	1
370630020153	370630020152	1
370630020153	370630020151	1
370630020153	370630006001	1
370630020153	370630020162	1
370630020153	370630020173	1
370630002002	370630009002	1
370630002002	370630009001	1
370630002002	370630002003	1
370630002002	370630002001	1
370630002002	370630022001	1
370630018021	370630018011	1
370630018021	370630018022	1
370630018021	370630018012	1
370630018021	370630010021	1
370630018021	370630018023	1
370630018021	370630018062	1
370630018021	370630018073	1
370630020162	370630020081	1
370630020162	370630020152	1
370630020162	370630020082	1
370630020162	370630020161	1
370630020162	370630020153	1
370630020162	370630020173	1
370630020173	370630020182	1
370630020173	370630020171	1
370630020173	370630020172	1
370630020173	370630020161	1
370630020173	370630020181	1
370630020173	370630020153	1
370630020173	370630020162	1
370630020183	370630020072	1
370630020183	370630020182	1
370630020183	370630020082	1
370630020183	370630020181	1
370630020183	370630020191	1
370630020183	370630020193	1
370630020191	370630020211	1
370630020191	370630020192	1
370630020191	370630020183	1
370630020191	370630020193	1
370630020191	370630020201	1
370630020193	370630020181	1
370630020193	370630020192	1
370630020193	370630020183	1
370630020193	370630020191	1
370630020201	370630020211	1
370630020201	370630020192	1
370630020201	370630020202	1
370630020201	370630020191	1
