,OBJECTID,stateid,white,black,hispanic,asian,total,% white,% black,% asian,% hispanic,year
0,1,320319,531,372,159,56,1118,0.4749552772808587,0.33273703041144903,0.05008944543828265,0.14221824686940965,2010
1,4,320313,175,165,68,71,479,0.3653444676409186,0.3444676409185804,0.14822546972860126,0.1419624217118998,2010
2,7,320310,75,412,171,0,658,0.11398176291793313,0.6261398176291794,0.0,0.25987841945288753,2010
3,10,320327,444,189,190,75,898,0.49443207126948774,0.21046770601336304,0.08351893095768374,0.21158129175946547,2010
4,13,320304,265,1123,420,63,1871,0.14163548904329235,0.6002137894174239,0.03367183324425441,0.2244788882950294,2010
5,15,320328,172,548,237,22,979,0.17568947906026558,0.5597548518896833,0.02247191011235955,0.24208375893769152,2010
6,16,320324,266,185,52,68,571,0.4658493870402802,0.3239929947460595,0.1190893169877408,0.09106830122591944,2010
7,18,320348,405,28,5,15,453,0.8940397350993378,0.06181015452538632,0.033112582781456956,0.011037527593818985,2010
8,21,320320,141,791,225,0,1157,0.12186689714779603,0.6836646499567848,0.0,0.1944684528954192,2010
9,25,320315,193,633,60,70,956,0.20188284518828453,0.6621338912133892,0.07322175732217573,0.06276150627615062,2010
10,27,320352,130,547,289,1,967,0.1344364012409514,0.5656670113753878,0.001034126163391934,0.2988624612202689,2010
11,32,320360,196,292,283,12,783,0.2503192848020434,0.37292464878671777,0.01532567049808429,0.3614303959131545,2010
12,34,320400,33,205,212,0,450,0.07333333333333333,0.45555555555555555,0.0,0.4711111111111111,2010
13,36,320363,277,146,84,8,515,0.537864077669903,0.283495145631068,0.015533980582524271,0.16310679611650486,2010
14,39,320332,394,134,364,25,917,0.4296619411123228,0.14612868047982552,0.027262813522355506,0.3969465648854962,2010
15,42,320339,135,84,48,0,267,0.5056179775280899,0.3146067415730337,0.0,0.1797752808988764,2010
16,43,320340,395,97,51,27,570,0.6929824561403509,0.17017543859649123,0.04736842105263158,0.08947368421052632,2010
17,45,320374,81,200,69,0,350,0.23142857142857143,0.5714285714285714,0.0,0.19714285714285715,2010
18,49,320344,26,309,93,0,428,0.06074766355140187,0.7219626168224299,0.0,0.21728971962616822,2010
19,53,320372,207,218,85,27,537,0.3854748603351955,0.4059590316573557,0.05027932960893855,0.15828677839851024,2010
20,56,320362,458,445,165,52,1120,0.4089285714285714,0.39732142857142855,0.04642857142857143,0.14732142857142858,2010
21,59,320388,5,179,38,0,222,0.02252252252252252,0.8063063063063063,0.0,0.17117117117117117,2010
22,60,320376,126,193,91,3,413,0.3050847457627119,0.46731234866828086,0.007263922518159807,0.22033898305084745,2010
0,1,320319,648,330,115,81,1174,0.5519591141396933,0.28109028960817717,0.06899488926746167,0.09795570698466781,2011
1,4,320313,183,171,60,27,441,0.41496598639455784,0.3877551020408163,0.061224489795918366,0.1360544217687075,2011
2,7,320310,145,373,199,0,717,0.20223152022315202,0.5202231520223152,0.0,0.2775453277545328,2011
3,10,320327,507,171,255,62,995,0.5095477386934674,0.17185929648241205,0.062311557788944726,0.2562814070351759,2011
4,13,320304,438,1066,621,108,2233,0.1961486789072996,0.477384684281236,0.0483654276757725,0.2781012091356919,2011
5,15,320328,144,462,217,5,828,0.17391304347826086,0.5579710144927537,0.006038647342995169,0.26207729468599034,2011
6,16,320324,342,124,58,21,545,0.6275229357798165,0.22752293577981653,0.03853211009174312,0.10642201834862386,2011
7,18,320348,344,37,9,11,401,0.85785536159601,0.09226932668329177,0.02743142144638404,0.022443890274314215,2011
8,21,320320,203,781,228,1,1213,0.16735366859027206,0.6438582028029678,0.0008244023083264633,0.18796372629843364,2011
9,25,320315,175,767,48,73,1063,0.16462841015992474,0.7215428033866416,0.06867356538099718,0.045155221072436504,2011
10,27,320352,263,562,394,1,1220,0.2155737704918033,0.460655737704918,0.000819672131147541,0.32295081967213113,2011
11,32,320360,191,260,293,17,761,0.25098554533508544,0.3416557161629435,0.022339027595269383,0.38501971090670173,2011
12,34,320400,78,212,206,0,496,0.15725806451612903,0.4274193548387097,0.0,0.4153225806451613,2011
13,36,320363,285,143,79,20,527,0.540796963946869,0.2713472485768501,0.03795066413662239,0.14990512333965844,2011
14,39,320332,484,208,373,25,1090,0.44403669724770645,0.1908256880733945,0.022935779816513763,0.3422018348623853,2011
15,42,320339,113,100,107,0,320,0.353125,0.3125,0.0,0.334375,2011
16,43,320340,344,109,33,27,513,0.6705653021442495,0.2124756335282651,0.05263157894736842,0.06432748538011696,2011
17,45,320374,43,196,39,0,278,0.15467625899280577,0.7050359712230215,0.0,0.14028776978417265,2011
18,49,320344,21,282,76,0,379,0.055408970976253295,0.7440633245382586,0.0,0.20052770448548812,2011
19,53,320372,233,180,106,24,543,0.429097605893186,0.3314917127071823,0.04419889502762431,0.19521178637200737,2011
20,56,320362,462,524,151,39,1176,0.39285714285714285,0.445578231292517,0.03316326530612245,0.1284013605442177,2011
21,59,320388,3,165,31,0,199,0.01507537688442211,0.8291457286432161,0.0,0.15577889447236182,2011
22,60,320376,112,192,105,4,413,0.2711864406779661,0.4648910411622276,0.009685230024213076,0.2542372881355932,2011
0,1,320319,542,306,89,72,1009,0.5371655104063429,0.30327056491575816,0.07135777998017839,0.08820614469772052,2012
1,4,320313,233,167,85,27,512,0.455078125,0.326171875,0.052734375,0.166015625,2012
2,7,320310,204,295,203,0,702,0.2905982905982906,0.4202279202279202,0.0,0.28917378917378916,2012
3,10,320327,518,193,197,43,951,0.544689800210305,0.20294426919032596,0.0452155625657203,0.20715036803364878,2012
4,13,320304,508,1021,603,94,2226,0.22821203953279426,0.458670260557053,0.042228212039532795,0.27088948787061995,2012
5,15,320328,226,445,202,51,924,0.24458874458874458,0.4816017316017316,0.05519480519480519,0.21861471861471862,2012
6,16,320324,346,134,88,17,585,0.5914529914529915,0.22905982905982905,0.02905982905982906,0.15042735042735042,2012
7,18,320348,307,31,29,12,379,0.8100263852242744,0.08179419525065963,0.0316622691292876,0.07651715039577836,2012
8,21,320320,343,802,395,0,1540,0.22272727272727272,0.5207792207792208,0.0,0.2564935064935065,2012
9,25,320315,195,723,88,61,1067,0.18275538894095594,0.6776007497656982,0.05716963448922212,0.08247422680412371,2012
10,27,320352,243,446,359,1,1049,0.23164918970448045,0.4251668255481411,0.0009532888465204957,0.342230695900858,2012
11,32,320360,236,321,326,18,901,0.2619311875693674,0.3562708102108768,0.01997780244173141,0.36182019977802443,2012
12,34,320400,161,226,229,0,616,0.26136363636363635,0.36688311688311687,0.0,0.3717532467532468,2012
13,36,320363,392,142,97,31,662,0.5921450151057401,0.21450151057401812,0.04682779456193353,0.14652567975830816,2012
14,39,320332,494,274,284,15,1067,0.4629803186504217,0.25679475164011245,0.014058106841611996,0.2661668228678538,2012
15,42,320339,158,219,116,0,493,0.3204868154158215,0.44421906693711966,0.0,0.23529411764705882,2012
16,43,320340,378,111,70,27,586,0.6450511945392492,0.189419795221843,0.04607508532423208,0.11945392491467577,2012
17,45,320374,94,213,69,0,376,0.25,0.5664893617021277,0.0,0.18351063829787234,2012
18,49,320344,27,303,79,0,409,0.06601466992665037,0.7408312958435208,0.0,0.19315403422982885,2012
19,53,320372,274,224,118,24,640,0.428125,0.35,0.0375,0.184375,2012
20,56,320362,360,569,140,48,1117,0.3222918531781558,0.5094001790510295,0.04297224709042077,0.12533572068039392,2012
21,59,320388,24,140,50,0,214,0.11214953271028037,0.6542056074766355,0.0,0.2336448598130841,2012
22,60,320376,133,191,89,4,417,0.31894484412470026,0.4580335731414868,0.009592326139088728,0.21342925659472423,2012
0,1,320319,723,200,51,36,1010,0.7158415841584158,0.19801980198019803,0.03564356435643564,0.0504950495049505,2013
1,4,320313,240,160,98,23,521,0.46065259117082535,0.30710172744721687,0.044145873320537425,0.18809980806142035,2013
2,7,320310,251,303,245,0,799,0.3141426783479349,0.37922403003754696,0.0,0.30663329161451813,2013
3,10,320327,432,131,235,23,821,0.5261875761266748,0.15956151035322777,0.028014616321559074,0.2862362971985384,2013
4,13,320304,562,1204,540,141,2447,0.2296689824274622,0.49203105843890477,0.05762157744176543,0.2206783816918676,2013
5,15,320328,311,379,257,42,989,0.31445904954499493,0.3832153690596562,0.042467138523761376,0.25985844287158744,2013
6,16,320324,278,120,83,9,490,0.5673469387755102,0.24489795918367346,0.018367346938775512,0.16938775510204082,2013
7,18,320348,325,88,40,8,461,0.7049891540130152,0.19088937093275488,0.01735357917570499,0.08676789587852494,2013
8,21,320320,444,613,364,0,1421,0.3124560168895144,0.4313863476425053,0.0,0.2561576354679803,2013
9,25,320315,210,666,122,64,1062,0.1977401129943503,0.6271186440677966,0.060263653483992465,0.11487758945386065,2013
10,27,320352,364,390,417,1,1172,0.310580204778157,0.33276450511945393,0.0008532423208191126,0.35580204778157,2013
11,32,320360,242,387,286,16,931,0.25993555316863587,0.41568206229860366,0.017185821697099892,0.3071965628356606,2013
12,34,320400,208,246,274,0,728,0.2857142857142857,0.33791208791208793,0.0,0.37637362637362637,2013
13,36,320363,421,190,81,28,720,0.5847222222222223,0.2638888888888889,0.03888888888888889,0.1125,2013
14,39,320332,495,295,329,17,1136,0.4357394366197183,0.2596830985915493,0.014964788732394365,0.289612676056338,2013
15,42,320339,188,211,171,0,570,0.3298245614035088,0.3701754385964912,0.0,0.3,2013
16,43,320340,380,137,95,8,620,0.6129032258064516,0.22096774193548388,0.012903225806451613,0.1532258064516129,2013
17,45,320374,99,211,99,0,409,0.24205378973105135,0.5158924205378973,0.0,0.24205378973105135,2013
18,49,320344,27,250,78,0,355,0.07605633802816901,0.704225352112676,0.0,0.21971830985915494,2013
19,53,320372,169,229,98,22,518,0.32625482625482627,0.4420849420849421,0.04247104247104247,0.1891891891891892,2013
20,56,320362,404,527,141,36,1108,0.36462093862815886,0.4756317689530686,0.032490974729241874,0.1272563176895307,2013
21,59,320388,35,148,66,0,249,0.14056224899598393,0.5943775100401606,0.0,0.26506024096385544,2013
22,60,320376,168,250,96,3,517,0.32495164410058025,0.4835589941972921,0.005802707930367505,0.18568665377176016,2013
0,1,320319,819,185,103,70,1177,0.6958368734069669,0.15717926932880205,0.059473237043330504,0.0875106202209006,2014
1,4,320313,228,142,98,8,476,0.4789915966386555,0.29831932773109243,0.01680672268907563,0.20588235294117646,2014
2,7,320310,195,276,189,0,660,0.29545454545454547,0.41818181818181815,0.0,0.2863636363636364,2014
3,10,320327,383,101,245,17,746,0.5134048257372654,0.1353887399463807,0.022788203753351208,0.3284182305630027,2014
4,13,320304,608,1371,524,136,2639,0.2303902993558166,0.5195149677908298,0.051534672224327394,0.19856006062902615,2014
5,15,320328,282,328,273,36,919,0.3068552774755169,0.35690968443960824,0.03917301414581066,0.2970620239390642,2014
6,16,320324,318,67,76,15,476,0.6680672268907563,0.1407563025210084,0.031512605042016806,0.15966386554621848,2014
7,18,320348,349,103,33,9,494,0.7064777327935222,0.20850202429149797,0.018218623481781375,0.06680161943319839,2014
8,21,320320,420,556,425,0,1401,0.29978586723768735,0.396859386152748,0.0,0.3033547466095646,2014
9,25,320315,210,504,126,4,844,0.24881516587677724,0.5971563981042654,0.004739336492890996,0.14928909952606634,2014
10,27,320352,300,358,401,1,1060,0.2830188679245283,0.33773584905660375,0.0009433962264150943,0.37830188679245286,2014
11,32,320360,341,360,291,17,1009,0.3379583746283449,0.35678889990089196,0.01684836471754212,0.288404360753221,2014
12,34,320400,107,285,153,0,545,0.1963302752293578,0.5229357798165137,0.0,0.28073394495412846,2014
13,36,320363,453,181,177,31,842,0.5380047505938242,0.21496437054631828,0.03681710213776722,0.21021377672209027,2014
14,39,320332,509,291,355,19,1174,0.4335604770017036,0.24787052810902896,0.016183986371379896,0.3023850085178876,2014
15,42,320339,177,227,128,0,532,0.33270676691729323,0.4266917293233083,0.0,0.24060150375939848,2014
16,43,320340,370,127,86,9,592,0.625,0.21452702702702703,0.015202702702702704,0.14527027027027026,2014
17,45,320374,132,281,86,0,499,0.26452905811623245,0.56312625250501,0.0,0.17234468937875752,2014
18,49,320344,52,280,80,0,412,0.1262135922330097,0.6796116504854369,0.0,0.1941747572815534,2014
19,53,320372,275,231,134,3,643,0.4276827371695179,0.359253499222395,0.004665629860031105,0.208398133748056,2014
20,56,320362,439,539,228,49,1255,0.349800796812749,0.4294820717131474,0.03904382470119522,0.18167330677290836,2014
21,59,320388,36,182,61,0,279,0.12903225806451613,0.6523297491039427,0.0,0.21863799283154123,2014
22,60,320376,221,224,106,4,555,0.3981981981981982,0.4036036036036036,0.007207207207207207,0.19099099099099098,2014
0,1,320319,818,262,71,63,1214,0.6738056013179572,0.2158154859967051,0.051894563426688634,0.05848434925864909,2015
1,4,320313,320,174,176,4,674,0.47477744807121663,0.258160237388724,0.005934718100890208,0.26112759643916916,2015
2,7,320310,214,290,240,0,744,0.28763440860215056,0.3897849462365591,0.0,0.3225806451612903,2015
3,10,320327,478,127,328,14,947,0.5047518479408659,0.1341077085533263,0.014783526927138331,0.34635691657866946,2015
4,13,320304,565,1282,454,118,2419,0.23356758991318727,0.5299710624224886,0.04878048780487805,0.18768085985944605,2015
5,15,320328,365,312,352,26,1055,0.3459715639810427,0.2957345971563981,0.024644549763033177,0.33364928909952607,2015
6,16,320324,429,65,108,17,619,0.6930533117932148,0.1050080775444265,0.027463651050080775,0.17447495961227788,2015
7,18,320348,308,128,28,6,470,0.6553191489361702,0.2723404255319149,0.01276595744680851,0.059574468085106386,2015
8,21,320320,483,491,469,0,1443,0.33471933471933474,0.34026334026334026,0.0,0.325017325017325,2015
9,25,320315,257,466,154,3,880,0.29204545454545455,0.5295454545454545,0.003409090909090909,0.175,2015
10,27,320352,334,299,382,0,1015,0.32906403940886697,0.29458128078817736,0.0,0.37635467980295567,2015
11,32,320360,316,367,234,0,917,0.3446019629225736,0.40021810250817885,0.0,0.25517993456924754,2015
12,34,320400,112,297,152,0,561,0.19964349376114082,0.5294117647058824,0.0,0.2709447415329768,2015
13,36,320363,514,207,248,31,1000,0.514,0.207,0.031,0.248,2015
14,39,320332,750,301,521,22,1594,0.47051442910915936,0.18883312421580928,0.013801756587202008,0.32685069008782935,2015
15,42,320339,193,236,136,0,565,0.3415929203539823,0.4176991150442478,0.0,0.2407079646017699,2015
16,43,320340,366,137,76,6,585,0.6256410256410256,0.2341880341880342,0.010256410256410256,0.12991452991452992,2015
17,45,320374,102,313,69,0,484,0.21074380165289255,0.6466942148760331,0.0,0.14256198347107438,2015
18,49,320344,33,289,46,0,368,0.08967391304347826,0.7853260869565217,0.0,0.125,2015
19,53,320372,276,273,89,3,641,0.43057722308892354,0.42589703588143524,0.0046801872074883,0.13884555382215288,2015
20,56,320362,502,583,187,33,1305,0.3846743295019157,0.4467432950191571,0.02528735632183908,0.14329501915708812,2015
21,59,320388,28,198,56,0,282,0.09929078014184398,0.7021276595744681,0.0,0.19858156028368795,2015
22,60,320376,219,240,91,0,550,0.3981818181818182,0.43636363636363634,0.0,0.16545454545454547,2015
0,1,320319,761,215,74,86,1136,0.6698943661971831,0.1892605633802817,0.07570422535211267,0.06514084507042253,2016
1,4,320313,284,172,187,10,653,0.4349157733537519,0.26339969372128635,0.015313935681470138,0.28637059724349156,2016
2,7,320310,201,256,260,0,717,0.2803347280334728,0.35704323570432356,0.0,0.36262203626220363,2016
3,10,320327,466,117,325,15,923,0.504875406283857,0.1267605633802817,0.016251354279523293,0.352112676056338,2016
4,13,320304,693,1337,413,86,2529,0.27402135231316727,0.5286674574930803,0.034005535784895215,0.16330565440885725,2016
5,15,320328,429,441,402,35,1307,0.32823259372609026,0.33741392501912776,0.026778882938026015,0.30757459831675593,2016
6,16,320324,408,120,143,16,687,0.5938864628820961,0.17467248908296942,0.023289665211062592,0.2081513828238719,2016
7,18,320348,291,103,30,9,433,0.6720554272517321,0.23787528868360278,0.020785219399538105,0.06928406466512702,2016
8,21,320320,517,318,411,1,1247,0.41459502806736165,0.2550120288692863,0.0008019246190858059,0.32959101844426625,2016
9,25,320315,304,429,187,14,934,0.32548179871520344,0.4593147751605996,0.014989293361884369,0.20021413276231265,2016
10,27,320352,350,285,395,11,1041,0.33621517771373677,0.2737752161383285,0.010566762728146013,0.3794428434197887,2016
11,32,320360,293,387,220,2,902,0.32483370288248337,0.42904656319290463,0.0022172949002217295,0.24390243902439024,2016
12,34,320400,109,257,185,0,551,0.19782214156079855,0.4664246823956443,0.0,0.33575317604355714,2016
13,36,320363,497,228,261,8,994,0.5,0.22937625754527163,0.008048289738430584,0.2625754527162978,2016
14,39,320332,711,274,491,21,1497,0.4749498997995992,0.18303273213092852,0.014028056112224449,0.32798931195724784,2016
15,42,320339,140,245,77,27,489,0.28629856850715746,0.5010224948875256,0.05521472392638037,0.1574642126789366,2016
16,43,320340,371,123,98,9,601,0.6173044925124792,0.20465890183028287,0.014975041597337771,0.16306156405990016,2016
17,45,320374,143,292,59,0,494,0.2894736842105263,0.5910931174089069,0.0,0.1194331983805668,2016
18,49,320344,44,197,47,0,288,0.1527777777777778,0.6840277777777778,0.0,0.16319444444444445,2016
19,53,320372,277,248,95,5,625,0.4432,0.3968,0.008,0.152,2016
20,56,320362,543,601,288,40,1472,0.3688858695652174,0.40828804347826086,0.02717391304347826,0.1956521739130435,2016
21,59,320388,35,235,46,0,316,0.11075949367088607,0.7436708860759493,0.0,0.14556962025316456,2016
22,60,320376,244,257,92,3,596,0.40939597315436244,0.4312080536912752,0.0050335570469798654,0.15436241610738255,2016
0,1,320319,760,74,88,68,990,0.7676767676767676,0.07474747474747474,0.06868686868686869,0.08888888888888889,2017
1,4,320313,274,213,189,3,679,0.40353460972017674,0.3136966126656848,0.004418262150220913,0.27835051546391754,2017
2,7,320310,174,245,229,0,648,0.26851851851851855,0.37808641975308643,0.0,0.3533950617283951,2017
3,10,320327,526,123,354,8,1011,0.5202769535113749,0.12166172106824925,0.00791295746785361,0.35014836795252224,2017
4,13,320304,674,1486,399,81,2640,0.2553030303030303,0.5628787878787879,0.03068181818181818,0.15113636363636362,2017
5,15,320328,407,528,421,9,1365,0.29816849816849816,0.3868131868131868,0.006593406593406593,0.30842490842490844,2017
6,16,320324,355,166,101,6,628,0.5652866242038217,0.2643312101910828,0.009554140127388535,0.160828025477707,2017
7,18,320348,272,94,20,0,386,0.7046632124352331,0.24352331606217617,0.0,0.05181347150259067,2017
8,21,320320,525,433,473,1,1432,0.36662011173184356,0.3023743016759777,0.0006983240223463687,0.3303072625698324,2017
9,25,320315,329,478,198,12,1017,0.32350049164208455,0.47000983284169123,0.011799410029498525,0.19469026548672566,2017
10,27,320352,406,296,445,15,1162,0.3493975903614458,0.2547332185886403,0.012908777969018933,0.382960413080895,2017
11,32,320360,301,381,267,2,951,0.31650893796004204,0.40063091482649843,0.002103049421661409,0.2807570977917981,2017
12,34,320400,71,220,151,0,442,0.16063348416289594,0.497737556561086,0.0,0.3416289592760181,2017
13,36,320363,556,259,291,8,1114,0.4991023339317774,0.2324955116696589,0.00718132854578097,0.2612208258527828,2017
14,39,320332,848,199,553,41,1641,0.5167580743449116,0.12126751980499695,0.024984765386959172,0.33698964046313223,2017
15,42,320339,156,90,90,11,347,0.4495677233429395,0.25936599423631124,0.03170028818443804,0.25936599423631124,2017
16,43,320340,314,122,59,0,495,0.6343434343434343,0.24646464646464647,0.0,0.1191919191919192,2017
17,45,320374,158,272,71,0,501,0.3153692614770459,0.5429141716566867,0.0,0.14171656686626746,2017
18,49,320344,59,165,63,0,287,0.20557491289198607,0.5749128919860628,0.0,0.21951219512195122,2017
19,53,320372,269,224,93,20,606,0.4438943894389439,0.3696369636963696,0.033003300330033,0.15346534653465346,2017
20,56,320362,504,535,230,91,1360,0.37058823529411766,0.39338235294117646,0.06691176470588235,0.16911764705882354,2017
21,59,320388,36,208,38,0,282,0.1276595744680851,0.7375886524822695,0.0,0.1347517730496454,2017
22,60,320376,257,328,112,4,701,0.3666191155492154,0.46790299572039945,0.005706134094151213,0.15977175463623394,2017
0,1,320319,894,96,154,74,1218,0.7339901477832512,0.07881773399014778,0.060755336617405585,0.12643678160919541,2018
1,4,320313,276,184,172,3,635,0.4346456692913386,0.28976377952755905,0.004724409448818898,0.27086614173228346,2018
2,7,320310,232,259,248,0,739,0.31393775372124494,0.35047361299052776,0.0,0.33558863328822736,2018
3,10,320327,507,149,318,10,984,0.5152439024390244,0.15142276422764228,0.01016260162601626,0.3231707317073171,2018
4,13,320304,721,1376,408,36,2541,0.2837465564738292,0.5415190869736324,0.014167650531286895,0.16056670602125148,2018
5,15,320328,372,545,392,15,1324,0.2809667673716012,0.411631419939577,0.011329305135951661,0.29607250755287007,2018
6,16,320324,421,161,139,23,744,0.5658602150537635,0.2163978494623656,0.030913978494623656,0.1868279569892473,2018
7,18,320348,286,77,12,0,375,0.7626666666666667,0.20533333333333334,0.0,0.032,2018
8,21,320320,534,373,502,9,1418,0.3765867418899859,0.2630465444287729,0.006346967559943582,0.3540197461212976,2018
9,25,320315,347,427,214,10,998,0.34769539078156314,0.4278557114228457,0.01002004008016032,0.21442885771543085,2018
10,27,320352,397,398,405,7,1207,0.32891466445733225,0.32974316487158245,0.00579950289975145,0.3355426677713339,2018
11,32,320360,318,405,279,1,1003,0.317048853439681,0.4037886340977069,0.0009970089730807576,0.2781655034895314,2018
12,34,320400,123,227,175,0,525,0.2342857142857143,0.43238095238095237,0.0,0.3333333333333333,2018
13,36,320363,633,229,339,9,1210,0.5231404958677686,0.18925619834710744,0.00743801652892562,0.2801652892561983,2018
14,39,320332,839,99,490,67,1495,0.5612040133779265,0.06622073578595318,0.044816053511705686,0.3277591973244147,2018
15,42,320339,144,72,76,13,305,0.4721311475409836,0.2360655737704918,0.04262295081967213,0.24918032786885247,2018
16,43,320340,306,104,63,0,473,0.6469344608879493,0.21987315010570824,0.0,0.1331923890063425,2018
17,45,320374,169,296,122,0,587,0.2879045996592845,0.504258943781942,0.0,0.20783645655877342,2018
18,49,320344,75,203,78,0,356,0.21067415730337077,0.5702247191011236,0.0,0.21910112359550563,2018
19,53,320372,284,331,105,20,740,0.3837837837837838,0.4472972972972973,0.02702702702702703,0.14189189189189189,2018
20,56,320362,514,531,211,79,1335,0.3850187265917603,0.39775280898876403,0.05917602996254682,0.15805243445692885,2018
21,59,320388,45,217,58,0,320,0.140625,0.678125,0.0,0.18125,2018
22,60,320376,235,478,104,2,819,0.2869352869352869,0.5836385836385837,0.002442002442002442,0.12698412698412698,2018
