time,0,1,2,3,4,5,6,7,8,9,10,11,12,13,14,15,16,17,18,19,20,21,22,23
2.5,-0.0606244362361,-0.100969092134,0.0159968453668,-0.114063695198,-0.0218051873456,0.0159968453668,-0.0126132177134,-0.085862199744,-0.0346292277032,-0.05611485635,-0.0269685106905,-0.14154443162,-0.10051716336,-0.0606244362361,-0.0709118582781,-0.0414680803856,-0.169558807789,-0.0870966475973,0.0035059011836,-0.0414680803856,-0.085862199744,0.0434208172009,0.0973596243117,-0.0126132177134
4.0,0.0159968453668,-0.0269685106905,0.180383663268,0.0035059011836,0.0768790875138,0.158015850239,0.0434208172009,-0.0414680803856,0.0406588996011,-0.0126132177134,0.0296150176759,-0.0737998249838,-0.0475682834107,0.0035059011836,-0.0269685106905,0.0296150176759,-0.10051716336,-0.00909413559603,0.135295773739,0.00160064150631,-0.0126132177134,0.0973596243117,0.1620653137,0.0296150176759
5.5,0.0035059011836,0.015675826718,0.135295773739,-0.00909413559603,0.0528336135472,0.135295773739,0.070642285936,-0.0269685106905,0.0406588996011,0.00160064150631,0.057095754098,-0.0870966475973,-0.0737998249838,-0.00909413559603,0.00160064150631,0.070642285936,-0.114063695198,-0.00909413559603,0.100530355578,0.0296150176759,0.0296150176759,0.123591165885,0.174665350479,0.057095754098
7.0,0.100530355578,0.110535013059,0.297567202638,0.123800134901,0.169243105662,0.287298867184,0.136530221592,0.0296150176759,0.146700537011,0.057095754098,0.136530221592,0.0035059011836,0.0035059011836,0.0887531878021,0.0434208172009,0.174665350479,-0.0346292277032,0.0887531878021,0.24547869149,0.110535013059,0.123591165885,0.199540019118,0.259912637098,0.123591165885
8.5,0.169243105662,0.223993062843,0.386834540735,0.202409969598,0.24547869149,0.386834540735,0.236065895143,0.070642285936,0.21329828574,0.0973596243117,0.211818348897,0.0406588996011,0.0406588996011,0.158015850239,0.0840628016983,0.283371609922,0.0035059011836,0.158015850239,0.337924940254,0.187156294662,0.236065895143,0.294959584197,0.329175299535,0.199540019118
10.0,0.24547869149,0.340402554958,0.452636599131,0.276956922963,0.327940851682,0.470898805524,0.340402554958,0.136530221592,0.276956922963,0.1620653137,0.317859986307,0.0887531878021,0.112212160626,0.224105040697,0.14935426195,0.405990896586,0.0528336135472,0.23483144729,0.405943363683,0.283371609922,0.362598301072,0.384457735036,0.448116372258,0.283371609922
11.5,0.307762969744,0.478922419039,0.524338064485,0.347840409119,0.377184370701,0.558895286521,0.468726651934,0.187156294662,0.347840409119,0.236065895143,0.448116372258,0.135295773739,0.158015850239,0.297567202638,0.199540019118,0.557993990031,0.100530355578,0.297567202638,0.461796598416,0.416638140785,0.50908438955,0.518999858415,0.528847644371,0.405990896586
13.0,0.347840409119,0.623796048426,0.488932728354,0.367469215868,0.424802390934,0.533055281586,0.586563142227,0.259912637098,0.386834540735,0.294959584197,0.56758003886,0.169243105662,0.180383663268,0.337924940254,0.271689804874,0.660092177649,0.135295773739,0.347840409119,0.470898805524,0.538628665164,0.651103394422,0.642058254819,0.605299704809,0.528847644371
14.5,0.470898805524,0.788606918172,0.649868946569,0.461796598416,0.541720142713,0.665810490438,0.747027814421,0.373569418893,0.50674400447,0.416638140785,0.721492722314,0.287298867184,0.287298867184,0.452636599131,0.373569418893,0.821028395864,0.2560479332,0.461796598416,0.609226962072,0.695497513781,0.796780849618,0.772118795384,0.772118795384,0.669025302419
16.0,0.550333273018,0.936505613284,0.74297835096,0.550333273018,0.625621400322,0.757928692426,0.906604127571,0.489046636313,0.592644077876,0.538628665164,0.876069759422,0.327940851682,0.337924940254,0.515567854857,0.489046636313,1.00160064151,0.307762969744,0.541720142713,0.704910310127,0.844875137819,0.965799920078,0.936505613284,0.906604127571,0.821028395864
17.5,0.575868365125,1.09072653198,0.689397310756,0.541720142713,0.641831627503,0.74297835096,1.09072653198,0.548343819997,0.617447468877,0.605299704809,1.0434208172,0.377184370701,0.337924940254,0.567406786377,0.56758003886,1.13007519946,0.347840409119,0.575868365125,0.665810490438,1.00160064151,1.13653022159,1.07064228594,1.01567582672,0.94388514365
19.0,0.697174661347,1.25398780314,0.85845556838,0.657861737322,0.765346163989,0.892725470465,1.22399306284,0.677903453766,0.74297835096,0.721492722314,1.18715629466,0.415403692932,0.424802390934,0.673715688523,0.669025302419,1.2891772316,0.424802390934,0.689397310756,0.809067541418,1.19336144419,1.28337160992,1.23004210752,1.19336144419,1.11053501306
20.5,0.780067669696,1.41132434089,0.93280290984,0.72787145857,0.844516377422,0.971797041456,1.37356941889,0.812991076799,0.844516377422,0.844875137819,1.34598358722,0.497865853124,0.479943945127,0.765346163989,0.788606918172,1.43246310795,0.452636599131,0.787372470319,0.885936304802,1.30645522303,1.41663814079,1.3570812961,1.32352873639,1.2118183489
22.0,0.872261367905,1.52393215396,0.978194812654,0.794640470783,0.93280290984,1.04675909914,1.52393215396,0.94388514365,0.926200175016,0.980226990714,1.50908438955,0.541720142713,0.541720142713,0.851502807739,0.921632336803,1.58656314223,0.515567854857,0.872261367905,0.952431716589,1.45329661136,1.53374644378,1.47383354237,1.41132434089,1.37356941889
23.5,0.965370772297,1.6145775184,1.02838056982,0.85845556838,1.02220199489,1.11221216063,1.70421473088,1.09072653198,1.01599684537,1.14935426195,1.66902530242,0.600959346088,0.609226962072,0.939375563764,1.07736814912,1.69111907327,0.575868365125,0.971797041456,1.02220199489,1.60994606967,1.64205825482,1.57710281298,1.49910030098,1.46360161976
25.0,1.00976489166,1.71287959201,1.00350590118,0.885936304802,1.08282835385,1.1238001349,1.82902118662,1.22399306284,1.06490644585,1.2599126371,1.8129910768,0.657861737322,0.641831627503,1.00350590118,1.21791854843,1.79678084962,0.625621400322,1.02838056982,1.0406588996,1.72578008072,1.71719258488,1.62838331792,1.52393215396,1.55317697373
26.5,1.07090518647,1.84881155238,1.02220199489,0.919567082684,1.16364039943,1.2024099696,1.94020009684,1.34598358722,1.13529577374,1.40599089659,1.91413780026,0.72025827446,0.712604701917,1.10053035558,1.33479984873,1.89522933771,0.697174661347,1.11221216063,1.10053035558,1.86445067616,1.82503032642,1.72578008072,1.56758003886,1.6465879133
28.0,1.19143885178,1.97663372599,1.10638308182,0.95891575016,1.27695692296,1.30267409307,2.0468517226,1.47383354237,1.26654030702,1.54349442034,2.0570957541,0.830441192211,0.809067541418,1.19143885178,1.49910030098,2.01567582672,0.801872040014,1.2241050407,1.21329828574,2.01567582672,1.98022699071,1.8875960128,1.65560478666,1.69986270634
29.5,1.26654030702,2.02961501768,1.09465378924,0.965370772297,1.36258699449,1.30776296974,2.09404689027,1.59596184023,1.34784040912,1.66902530242,2.10066476904,0.906208699829,0.892725470465,1.27175801629,1.62379604843,2.02614282577,0.885936304802,1.32292277691,1.27695692296,2.0434208172,2.02266225703,1.97303148931,1.72149272231,1.75124006571
31.0,1.2241050407,2.0468517226,1.02220199489,0.912903352403,1.39642058956,1.24547869149,2.12033818809,1.66902530242,1.27695692296,1.76380352717,2.12033818809,0.952431716589,0.952431716589,1.23483144729,1.68232212503,2.0570957541,0.945918409631,1.33792494025,1.28213716207,2.0840628017,2.03653443162,1.94756080179,1.72578008072,1.80085051393
32.5,1.28213716207,2.16837908763,1.06490644585,0.912903352403,1.50231175816,1.27695692296,2.22095900275,1.8566523056,1.36258699449,1.94020009684,2.2390683833,1.04675909914,1.06490644585,1.30267409307,1.86833411064,2.15254253958,1.06490644585,1.47994394513,1.32794085168,2.20875854915,2.17466535048,2.05368915265,1.78860691817,1.82902118662
34.0,1.24547869149,2.22095900275,1.04675909914,0.879115038946,1.51116267574,1.23483144729,2.23606589514,1.9548841426,1.30776296974,2.03653443162,2.28337160992,1.08282835385,1.10638308182,1.32292277691,1.90660412757,2.16837908763,1.11801778231,1.49786585312,1.30267409307,2.2118183489,2.18715629466,2.13330632072,1.81701533336,1.80895556356
35.5,1.16924310566,2.22095900275,0.997219638336,0.823351767424,1.45263659913,1.16924310566,2.24206463576,1.95122711899,1.19693483953,2.00160064151,2.2390683833,1.1238001349,1.14100942493,1.19693483953,1.87992208492,2.15889803462,1.14670053701,1.47089880552,1.23483144729,2.2056922461,2.15889803462,2.10725242907,1.83300103753,1.8049087305
37.0,1.21329828574,2.22399306284,1.0345327968,0.844516377422,1.50674400447,1.21871178193,2.2862773411,2.11053501306,1.20786439969,2.11053501306,2.2804600145,1.19143885178,1.19693483953,1.21329828574,1.99095339731,2.2056922461,1.20786439969,1.53739421731,1.26654030702,2.25695326162,2.21487167287,2.19645403924,1.95122711899,1.87220711979
38.5,1.1238001349,2.25695326162,0.965370772297,0.801872040014,1.41540369293,1.14670053701,2.2891772316,2.11707785893,1.1523692871,2.11707785893,2.2891772316,1.15801585024,1.16924310566,1.13529577374,2.07064228594,2.22399306284,1.1523692871,1.45722386863,1.19693483953,2.27168980487,2.21791854843,2.2118183489,1.89522933771,1.83300103753
40.0,1.10638308182,2.27461913591,0.945918409631,0.787372470319,1.38683454074,1.14670053701,2.2949595842,2.14295649075,1.12955940419,2.15572378683,2.2891772316,1.16364039943,1.16924310566,1.14100942493,2.09735962431,2.23606589514,1.1523692871,1.45722386863,1.19143885178,2.28337160992,2.22399306284,2.22399306284,1.91788993512,1.87220711979
41.5,1.08282835385,2.30071885349,0.945918409631,0.750472887507,1.35768819508,1.12955940419,2.30358988934,2.16522565459,1.11801778231,2.18715629466,2.31216887423,1.15801585024,1.15801585024,1.10638308182,2.11707785893,2.24803853681,1.1238001349,1.41068128269,1.17482413793,2.30645522303,2.24803853681,2.26286595449,1.89522933771,1.86833411064
43.0,1.06490644585,2.31216887423,0.906208699829,0.735444678275,1.33294153274,1.11801778231,2.33760392161,2.17779823996,1.09465378924,2.22702075554,2.30645522303,1.1523692871,1.12955940419,1.0887531878,2.13653022159,2.2599126371,1.09465378924,1.36746921587,1.16364039943,2.31501723654,2.2862773411,2.27461913591,1.89522933771,1.8566523056
44.5,1.02838056982,2.30358988934,0.879115038946,0.689397310756,1.29244217046,1.10053035558,2.32352873639,2.1840436828,1.04675909914,2.22095900275,2.29784209273,1.11221216063,1.10638308182,1.02220199489,2.15889803462,2.2599126371,1.07090518647,1.31283395929,1.12955940419,2.2949595842,2.27461913591,2.2804600145,1.90282248703,1.78860691817
46.0,1.00350590118,2.35984243578,0.830441192211,0.74297835096,1.28729886718,1.08282835385,2.37629921165,2.21791854843,1.02838056982,2.24206463576,2.34876602789,1.10053035558,1.08282835385,1.00350590118,2.19645403924,2.29207130487,1.06490644585,1.28729886718,1.10053035558,2.32352873639,2.30358988934,2.30071885349,1.89522933771,1.8409279533
47.5,1.00976489166,2.35154311256,0.844516377422,0.649868946569,1.27695692296,1.08282835385,2.32352873639,2.22702075554,1.01599684537,2.26581323854,2.30071885349,1.06490644585,1.05888265822,0.997219638336,2.23606589514,2.2891772316,1.0406588996,1.29244217046,1.11221216063,2.31216887423,2.30071885349,2.31501723654,1.91037588146,1.83300103753
