time,0,1,2,3,4,5,6,7,8,9,10,11,12,13,14,15,16,17,18,19,20,21,22,23
2.5,-0.00596820243598,-0.105503875987,0.0229373194053,-0.0337131929189,-0.101390815597,-0.00596820243598,-0.0477883781306,-0.0448072872306,-0.0477883781306,-0.0870355226199,-0.0587464781884,-0.0587464781884,0.0077067344611,-0.0477883781306,-0.0477883781306,-0.0728216634002,-0.0620022373503,-0.0448072872306,-0.0587464781884,-0.0448072872306,0.036112708153,-0.0448072872306,-0.0477883781306,-0.0337131929189
4.0,0.0346737820614,-0.0477883781306,0.0749319570435,0.0077067344611,-0.0448072872306,0.0479706046748,0.0077067344611,0.00964049679182,0.0077067344611,-0.0037800189705,0.00964049679182,-0.0037800189705,0.0611459934226,0.0077067344611,0.0077067344611,-0.0173265508085,-0.00596820243598,0.00964049679182,-0.0037800189705,0.00964049679182,0.100243045573,0.00964049679182,0.0077067344611,0.0346737820614
5.5,0.150150999481,0.0611459934226,0.185490332191,0.112676294063,0.036112708153,0.174604043206,0.112676294063,0.149570757936,0.0871412019555,0.100243045573,0.13739604399,0.0876430087931,0.174604043206,0.0999652423131,0.0999652423131,0.0749319570435,0.0999652423131,0.0876430087931,0.0876430087931,0.112733989756,0.232032918128,0.100243045573,0.112676294063,0.137767275025
7.0,0.257066203398,0.186676875506,0.31003543013,0.233982590285,0.149570757936,0.302154092926,0.257066203398,0.254752994628,0.186676875506,0.22053727929,0.254752994628,0.185490332191,0.324180399256,0.222300785237,0.233982590285,0.185490332191,0.222300785237,0.197267499968,0.208949305015,0.208949305015,0.352785077589,0.208949305015,0.233982590285,0.26847096667
8.5,0.398727352621,0.313209281435,0.444577553508,0.398727352621,0.277120807657,0.439657616676,0.398727352621,0.394304347027,0.313209281435,0.363277451407,0.444577553508,0.331568591679,0.479458624734,0.345875470356,0.345875470356,0.331568591679,0.356601876949,0.331568591679,0.320842185086,0.342215835879,0.483571685124,0.363277451407,0.367249121148,0.409069296843
10.0,0.508604970394,0.469610838778,0.530877399903,0.592669235182,0.414624331407,0.610703158013,0.583567028075,0.558533742805,0.429533399403,0.540155213491,0.567635949913,0.454425339465,0.646108494144,0.49895480036,0.508604970394,0.464206360257,0.49895480036,0.473921515091,0.454425339465,0.454425339465,0.603481148859,0.493157733953,0.527713793341,0.619636282783
11.5,0.697638794784,0.663490572372,0.722358544711,0.739217898535,0.54937374352,0.779632166981,0.763602057162,0.730486425595,0.592669235182,0.714184613266,0.738568771893,0.612304999246,0.787580920097,0.672103702677,0.68066571618,0.621075208874,0.68066571618,0.612304999246,0.612304999246,0.612304999246,0.793911805736,0.655632430911,0.739217898535,0.771639376228
13.0,0.834375131576,0.857215107934,0.876804814085,0.909142899978,0.714184613266,0.901838099354,0.923642469673,0.862083308378,0.771639376228,0.847210031896,0.854665836815,0.754598881712,0.916410900442,0.864748780619,0.842028704119,0.770452832912,0.849641888229,0.770452832912,0.746606090958,0.762547634827,0.934233094134,0.801647454516,0.887116593648,0.916410900442
14.5,0.945122197083,0.973273237397,0.975852183336,0.994031797564,0.83971549535,1.06114599342,1.04133751234,0.948239952128,0.909142899978,0.941253521812,0.982673449192,0.854665836815,1.09356747111,0.980225998039,0.980225998039,0.884109614708,1.01449590012,0.884109614708,0.816995418849,0.884109614708,1.02954005423,0.920088911814,1.0212532663,1.06114599342
16.0,1.15015099948,1.15630322646,1.09395678273,1.14397242455,0.968998512294,1.28541082909,1.22815351148,1.10024304557,1.04797060467,1.08764300879,1.14349624353,1.00294584422,1.30769227647,1.16242932926,1.2045987835,1.00294584422,1.13776727503,1.01630422707,0.975852183336,0.989462614854,1.20894930502,1.02293731941,1.22815351148,1.29659456758
17.5,1.26277985459,1.34048221159,1.23203291813,1.29659456758,1.07493195704,1.51819101922,1.44971128134,1.22629654858,1.15015099948,1.23203291813,1.29367198392,1.11273398976,1.53717412259,1.3350687154,1.39352844595,1.11893913928,1.2797862799,1.11893913928,1.11273398976,1.10650203604,1.31544892632,1.12511771421,1.40390759173,1.5037879541
19.0,1.39352844595,1.51340595666,1.26037754382,1.46961083878,1.16164359024,1.71857813248,1.64610849414,1.35804080304,1.23398259028,1.37887430646,1.50741842708,1.19726749997,1.73921789854,1.47945862473,1.64173005363,1.20894930502,1.37781836286,1.20312022621,1.25475299463,1.1736162319,1.40957110368,1.20894930502,1.67639106108,1.73921789854
20.5,1.47454313432,1.62851443413,1.39430434703,1.62851443413,1.27712080766,1.75956654393,1.74331065317,1.51214083732,1.37781836286,1.45932413888,1.56309202477,1.31003543013,1.79153893367,1.60621576702,1.71857813248,1.31003543013,1.52771379334,1.29914711399,1.39941123746,1.27156128231,1.49315773395,1.31544892632,1.73099739173,1.79942253274
22.0,1.5037879541,1.77963216698,1.40957110368,1.75956654393,1.32621535718,1.94512219708,1.84964188823,1.56309202477,1.42444452273,1.50268050807,1.70183622084,1.35804080304,1.9592663794,1.7875809201,1.87969912209,1.36849516068,1.62851443413,1.34221583588,1.42967867713,1.31544892632,1.55853374281,1.35804080304,1.91641090044,1.9732732374
23.5,1.49895480036,1.85343346739,1.47392151509,1.86098686182,1.39430434703,1.96628680708,1.91641090044,1.68101774933,1.51819101922,1.58118248175,1.71418461327,1.43466208464,1.9732732374,1.90183809935,1.93442230843,1.43466208464,1.71857813248,1.41462433141,1.54937374352,1.38403601157,1.6384572871,1.4196599213,2.00770673446,2.03467378206
25.0,1.52771379334,1.93442230843,1.53552376476,1.96978425132,1.45442533946,2.06442112546,2.01449590012,1.70183622084,1.56055705003,1.60348114886,1.82460860296,1.47875466883,2.05786340943,1.96978425132,2.00770673446,1.48357168512,1.79548611818,1.44950984905,1.61669676836,1.42967867713,1.68520554629,1.47392151509,2.0512757494,2.12213662331
26.5,1.53717412259,1.94156437767,1.53552376476,1.99746270296,1.48357168512,2.07744780575,2.0246201174,1.82460860296,1.58812531004,1.68101774933,1.8472100319,1.50741842708,2.07420214625,2.0212532663,2.0545733395,1.50741842708,1.82668073979,1.47875466883,1.6768177608,1.46420636026,1.71418461327,1.48837267139,2.11267629406,2.13465466316
28.0,1.56980512683,2.00088546861,1.57216560839,2.0545733395,1.54015521349,2.15323039241,2.10315351994,1.8986091844,1.62408218781,1.79002837125,1.90938902316,1.55853374281,2.13776727503,2.07420214625,2.14397242455,1.55396101302,1.87224331717,1.54015521349,1.72642820902,1.50741842708,1.77831495069,1.54015521349,2.13465466316,2.2045987835
29.5,1.57440702879,2.04465787063,1.64277027997,2.08714120196,1.59460299751,2.15630322646,2.08391730108,1.93071002757,1.68066571618,1.79002837125,1.97585218334,1.61230499925,2.14706501961,2.09996524231,2.14397242455,1.61669676836,1.9592663794,1.59014334932,1.70596410646,1.56309202477,1.81699541885,1.59460299751,2.15015099948,2.19566565873
31.0,1.58356702808,2.08714120196,1.6341313617,2.11899006799,1.62544040144,2.19566565873,2.15323039241,1.97585218334,1.71441450753,1.87313849689,2.01630422707,1.65135777581,2.18065308788,2.13153532131,2.17156998312,1.62544040144,2.03133033899,1.61669676836,1.76254763483,1.58118248175,1.88410961471,1.61669676836,2.17156998312,2.23107099486
32.5,1.65916464697,2.12840922033,1.61669676836,2.1685295288,1.60789982013,2.23688832146,2.2164242189,1.93423309413,1.73099739173,1.83971549535,1.95865656807,1.6384572871,2.23398259028,2.15015099948,2.18667687551,1.62979242598,2.02797912949,1.60348114886,1.70596410646,1.57216560839,1.82460860296,1.62544040144,2.20162721697,2.27130812597
34.0,1.66349057237,2.18967936367,1.64707041741,2.21347693485,1.66838092365,2.28821490197,2.25992585754,2.05888401581,1.71023883156,1.95865656807,2.07173661788,1.68520554629,2.27413971676,2.24557056456,2.23688832146,1.66838092365,2.09996524231,1.64707041741,1.73856877189,1.60348114886,1.9271783366,1.65989445776,2.27413971676,2.3350687154
35.5,1.67210370268,2.17156998312,1.65135777581,2.18065308788,1.6768177608,2.26277985459,2.24557056456,2.10337593506,1.79548611818,2.01297620936,2.11273398976,1.72235854471,2.26277985459,2.23107099486,2.23688832146,1.66414393077,2.07744780575,1.68101774933,1.75857873262,1.62979242598,1.96899851229,1.67260550951,2.2797862799,2.3323543307
37.0,1.68917721604,2.17156998312,1.65563243091,2.19566565873,1.70183622084,2.24845307309,2.26277985459,2.09395678273,1.79153893367,2.02624246413,2.09080334969,1.73453325866,2.2542008697,2.24268228524,2.23107099486,1.68938122227,2.08068617982,1.70183622084,1.77438924747,1.64707041741,1.97585218334,1.68520554629,2.2826012955,2.33777800266
38.5,1.69341420892,2.23978821197,1.6341313617,2.24268228524,1.73453325866,2.2570662034,2.34048221159,2.15863484036,1.76360205716,2.10024304557,2.16764233086,1.77831495069,2.28821490197,2.28821490197,2.2570662034,1.72642820902,2.11267629406,1.74259302845,1.7665056484,1.65135777581,2.01630422707,1.71418461327,2.3323543307,2.37781836286
40.0,1.71857813248,2.15323039241,1.68520554629,2.21052361746,1.73048642559,2.2045987835,2.27130812597,2.14653669785,1.77963216698,2.09080334969,2.10024304557,1.75459888171,2.2164242189,2.2164242189,2.17156998312,1.73856877189,2.06768883929,1.74660609096,1.80164745452,1.66838092365,1.99284525425,1.72235854471,2.26847096667,2.32418039926
41.5,1.69341420892,2.21347693485,1.66838092365,2.23398259028,1.77831495069,2.22230078524,2.31320928144,2.18253095671,1.81116774041,2.14653669785,2.18549033219,1.77831495069,2.24557056456,2.28821490197,2.23107099486,1.75857873262,2.09356747111,1.78223000069,1.80934184631,1.6768177608,2.00629705372,1.74259302845,2.34048221159,2.37518330269
43.0,1.71441450753,2.22230078524,1.68938122227,2.22815351148,1.83595357655,2.22230078524,2.31320928144,2.17956549823,1.7875809201,2.14653669785,2.16764233086,1.79002837125,2.24845307309,2.27696576084,2.23107099486,1.77831495069,2.09035791464,1.79778481488,1.82460860296,1.68938122227,1.99958683213,1.77045283291,2.33777800266,2.37254342082
44.5,1.77963216698,2.23978821197,1.69354484721,2.2570662034,1.78613445514,2.24845307309,2.35660187695,2.19139093363,1.75146149429,2.17956549823,2.17063237346,1.78613445514,2.2826012955,2.30492584218,2.24845307309,1.79391180574,2.10633476719,1.8131737079,1.82840018212,1.69354484721,1.98946261485,1.77438924747,2.34856455788,2.39613024114
46.0,1.71023883156,2.2797862799,1.68520554629,2.28821490197,1.80549978001,2.2826012955,2.39872735262,2.20019683101,1.79153893367,2.20894930502,2.18549033219,1.81699541885,2.3350687154,2.3323543307,2.2797862799,1.77831495069,2.13776727503,1.81699541885,1.83218182266,1.68938122227,1.98946261485,1.77045283291,2.39352844595,2.43713321526
47.5,1.71023883156,2.32144543154,1.66414393077,2.31870526919,1.78223000069,2.27413971676,2.43713321526,2.22053727929,1.76360205716,2.2462748407,2.2060377096,1.80164745452,2.33777800266,2.35660187695,2.30492584218,1.77438924747,2.13776727503,1.79002837125,1.82460860296,1.68520554629,1.98946261485,1.7665056484,2.43713321526,2.46466162281
