,plate,number,M NaCl,Strain,mM PQ
0,20150717 PQ 9,5,,ura3,0.0
1,20150717 PQ 9,6,,ura3,0.0
2,20150717 PQ 9,136,,ura3,0.333
3,20150717 PQ 9,135,,ura3,0.333
4,20150717 PQ 9,133,,ura3,0.333
5,20150717 PQ 9,10,,ura3,0.0
6,20150717 PQ 9,137,,ura3,0.333
7,20150717 PQ 9,3,,ura3,0.0
8,20150717 PQ 9,7,,ura3,0.0
9,20150717 PQ 9,8,,ura3,0.0
10,20150717 PQ 9,131,,ura3,0.333
11,20150717 PQ 9,132,,ura3,0.333
12,20150717 PQ 9,129,,ura3,0.333
13,20150717 PQ 9,11,,ura3,0.0
14,20150717 PQ 9,134,,ura3,0.333
15,20150717 PQ 9,127,,ura3,0.333
16,20150717 PQ 9,12,,ura3,0.0
17,20150717 PQ 9,128,,ura3,0.333
18,20150717 PQ 9,1,,ura3,0.0
19,20150717 PQ 9,126,,ura3,0.333
20,20150717 PQ 9,4,,ura3,0.0
21,20150717 PQ 9,13,,ura3,0.0
22,20150717 PQ 9,2,,ura3,0.0
23,20150717 PQ 9,130,,ura3,0.333
