,plate,number,M NaCl,Strain,mM PQ
0,20150715 PQ 8,118,,ura3,0.083
1,20150715 PQ 8,50,,ura3,0.0
2,20150715 PQ 8,59,,ura3,0.0
3,20150715 PQ 8,123,,ura3,0.083
4,20150715 PQ 8,119,,ura3,0.083
5,20150715 PQ 8,61,,ura3,0.0
6,20150715 PQ 8,121,,ura3,0.083
7,20150715 PQ 8,58,,ura3,0.0
8,20150715 PQ 8,51,,ura3,0.0
9,20150715 PQ 8,60,,ura3,0.0
10,20150715 PQ 8,124,,ura3,0.083
11,20150715 PQ 8,55,,ura3,0.0
12,20150715 PQ 8,125,,ura3,0.083
13,20150715 PQ 8,54,,ura3,0.0
14,20150715 PQ 8,57,,ura3,0.0
15,20150715 PQ 8,52,,ura3,0.0
16,20150715 PQ 8,122,,ura3,0.083
17,20150715 PQ 8,114,,ura3,0.083
18,20150715 PQ 8,56,,ura3,0.0
19,20150715 PQ 8,116,,ura3,0.083
20,20150715 PQ 8,115,,ura3,0.083
21,20150715 PQ 8,120,,ura3,0.083
22,20150715 PQ 8,117,,ura3,0.083
23,20150715 PQ 8,53,,ura3,0.0
