﻿solute,RMSE,method
GN_Ca,0.066318473,RF
GN_Cl,0.068626549,RF
GN_DIC,0.005588984,RF
GN_DOC,0.329521199,RF
GN_DON,0.021819301,RF
GN_F,0.008581285,RF
GN_Fe,0.007480404,RF
GN_K,0.031091534,RF
GN_Mg,0.024210604,RF
GN_Mn,0.001897046,RF
GN_Na,0.131361329,RF
GN_NH4,0.002213808,RF
GN_NO3,0.057020698,RF
GN_OMAl,0.010336606,RF
GN_PO4,0.000529989,RF
GN_SiO2,0.460874511,RF
GN_SO4,0.205986463,RF
GN_spCond,0.696375258,RF
GN_TDN,0.035588528,RF
GN_temp,0.972684468,RF
GN_TMAl,0.020658132,RF
GN_Ca,0.0472,LSTM
GN_Cl,0.0527,LSTM
GN_DIC,0.0073,LSTM
GN_DOC,0.2895,LSTM
GN_DON,0.0211,LSTM
GN_F,0.0077,LSTM
GN_Fe,0.0085,LSTM
GN_K,0.0361,LSTM
GN_Mg,0.0106,LSTM
GN_Mn,0.0019,LSTM
GN_Na,0.1053,LSTM
GN_NH4,0.0015,LSTM
GN_NO3,0.0778,LSTM
GN_OMAl,0.0066,LSTM
GN_PO4,0.0006,LSTM
GN_SiO2,0.4052,LSTM
GN_SO4,0.1409,LSTM
GN_spCond,0.5533,LSTM
GN_TDN,0.0189,LSTM
GN_temp,0.8227,LSTM
GN_TMAl,0.0155,LSTM
GN_Ca,0.06,SVM
GN_Cl,0.0592,SVM
GN_DIC,0.0077,SVM
GN_DOC,0.3041,SVM
GN_DON,0.0225,SVM
GN_F,0.008,SVM
GN_Fe,0.0082,SVM
GN_K,0.0385,SVM
GN_Mg,0.024,SVM
GN_Mn,0.002,SVM
GN_Na,0.1482,SVM
GN_NH4,0.0018,SVM
GN_NO3,0.097,SVM
GN_OMAl,0.0098,SVM
GN_PO4,0.0005,SVM
GN_SiO2,0.6362,SVM
GN_SO4,0.2454,SVM
GN_spCond,0.8906,SVM
GN_TDN,0.0395,SVM
GN_temp,2.8991,SVM
GN_TMAl,0.0179,SVM
