﻿solute,RF_rmse,SVM_rmse,LSTM_rmse
GN_Ca,0.0636,0.0600,0.0472
GN_Cl,0.1783,0.0592,0.0527
GN_DIC,0.5738,0.0077,0.0073
GN_DOC,1.6830,0.3041,0.2895
GN_DON,0.5322,0.0225,0.0211
GN_F,0.5796,0.0080,0.0077
GN_Fe,0.6081,0.0082,0.0085
GN_K,0.5058,0.0385,0.0361
GN_Mg,0.4306,0.0240,0.0106
GN_Mn,0.6115,0.0020,0.0019
GN_Na,0.1910,0.1482,0.1053
GN_NH4,0.6104,0.0018,0.0015
GN_NO3,0.4417,0.0970,0.0778
GN_OMAl,0.5864,0.0098,0.0066
GN_PO4,0.6121,0.0005,0.0006
GN_SiO2,4.6566,0.6362,0.4052
GN_SO4,1.9740,0.2454,0.1409
GN_spCond,9.6009,0.8906,0.5533
GN_TDN,0.4886,0.0395,0.0189
GN_temp,3.6071,2.8991,0.8227
GN_TMAl,0.5511,0.0179,0.0155
