﻿Date,Last Price
3/8/21,
3/4/21,109.67
2/24/21,109.75
2/15/21,109.45
11/13/20,109.17
10/12/20,108.56
10/9/20,108.55
10/6/20,108.55
8/25/20,108.04
8/21/20,108
7/17/20,106.97
7/10/20,107.05
7/8/20,106.92
6/11/20,106.65
6/3/20,106.25
5/28/20,106.99
5/21/20,106.9
5/18/20,106.3
5/12/20,106.15
5/8/20,105.9
5/5/20,106.15
4/30/20,107.3
4/29/20,107.22
4/28/20,107.18
4/27/20,107.03
4/23/20,107.02
4/22/20,106.95
4/17/20,106.1
4/16/20,105.9
4/9/20,105.73
4/6/20,106
4/3/20,105.55
4/2/20,105.44
4/1/20,105.05
3/31/20,104.77
3/30/20,104.6
3/26/20,106
3/25/20,106.25
3/24/20,106.5
3/23/20,106.85
3/20/20,106.28
3/19/20,105.22
3/17/20,103.63
3/13/20,102.64
3/11/20,102.5
3/10/20,102.7
3/9/20,102.93