﻿Date,Last Price
3/8/21,22.1239
3/5/21,22.1019
3/4/21,21.929
3/3/21,21.7029
3/2/21,21.6656
3/1/21,21.7278
2/26/21,21.6723
2/25/21,21.5463
2/24/21,21.3918
2/23/21,21.2907
2/22/21,21.3145
2/19/21,21.3671
2/18/21,21.435
2/17/21,21.4645
2/16/21,21.3259
2/15/21,21.1733
2/12/21,21.2385
2/11/21,21.2344
2/10/21,21.2677
2/9/21,21.2349
2/8/21,21.3166
2/5/21,21.4021
2/4/21,21.6045
2/3/21,21.5067
2/2/21,21.496
2/1/21,21.5155
1/29/21,21.4646
1/28/21,21.5008
1/27/21,21.5293
1/26/21,21.4273
1/25/21,21.546
1/22/21,21.4502
1/21/21,21.4489
1/20/21,21.553
1/19/21,21.565
1/18/21,21.6663
1/15/21,21.6615
1/14/21,21.5124
1/13/21,21.5159
1/12/21,21.4382
1/11/21,21.5966
1/8/21,21.4144
1/7/21,21.3675
1/6/21,21.237
1/5/21,21.2641
1/4/21,21.3858
1/1/21,21.4818
12/31/20,21.4746
12/30/20,21.3304
12/29/20,21.3956
12/28/20,21.562
12/25/20,21.521
12/24/20,21.5241
12/23/20,21.5991
12/22/20,21.6435
12/21/20,21.3965
12/18/20,21.326
12/17/20,21.3053
12/16/20,21.4623
12/15/20,21.6451
12/14/20,21.6986
12/11/20,21.7604
12/10/20,21.6978
12/9/20,21.7775
12/8/20,21.759
12/7/20,21.886
12/4/20,21.8337
12/3/20,21.7571
12/2/20,21.7757
12/1/20,21.7718
11/30/20,22.0071
11/27/20,21.8918
11/26/20,21.9535
11/25/20,21.9374
11/24/20,21.9805
11/23/20,22.2216
11/20/20,22.2352
11/19/20,22.1827
11/18/20,22.2357
11/17/20,22.3308
11/16/20,22.297
11/13/20,22.3259
11/12/20,22.4711
11/11/20,22.4435
11/10/20,22.3695
11/9/20,22.4362
11/6/20,22.3729
11/5/20,22.541
11/4/20,22.9094
11/3/20,22.9195
11/2/20,23.2775
10/30/20,23.3903
10/29/20,23.4459
10/28/20,23.3624
10/27/20,23.1635
10/26/20,23.1095
10/23/20,22.9445
10/22/20,23.0169
10/21/20,22.9538
10/20/20,22.9649
10/19/20,23.1768
10/16/20,23.2598
10/15/20,23.3624
10/14/20,23.2363
10/13/20,23.3014
10/12/20,23.0095
10/9/20,22.8414
10/8/20,23.1217
10/7/20,23.0283
10/6/20,23.0538
10/5/20,22.9969
10/2/20,23.1724
10/1/20,22.8547
9/30/20,23.0984
9/29/20,23.1576
9/28/20,23.3194
9/25/20,23.322
9/24/20,23.2219
9/23/20,23.1467
9/22/20,22.9916
9/21/20,23.0432
9/18/20,22.5813
9/17/20,22.5528
9/16/20,22.606
9/15/20,22.594
9/14/20,22.4675
9/11/20,22.4352
9/10/20,22.511
9/9/20,22.4496
9/8/20,22.5171
9/7/20,22.3999
9/4/20,22.364
9/3/20,22.2575
9/2/20,22.2149
9/1/20,22.0379
8/31/20,22.0015
8/28/20,21.9405
8/27/20,22.2334
8/26/20,22.1991
8/25/20,22.1193
8/24/20,22.128
8/21/20,22.095
8/20/20,21.9556
8/19/20,22.046
8/18/20,21.8889
8/17/20,22.0127
8/14/20,22.0286
8/13/20,22.1272
8/12/20,22.1819
8/11/20,22.2911
8/10/20,22.3529
8/7/20,22.3145
8/6/20,22.1494
8/5/20,21.9913
8/4/20,22.1362
8/3/20,22.3403
7/31/20,22.283
7/30/20,22.1395
7/29/20,22.214
7/28/20,22.4356
7/27/20,22.3018
7/24/20,22.5157
7/23/20,22.6861
7/22/20,22.7911
7/21/20,22.8542
7/20/20,23.2537
7/17/20,23.3284
7/16/20,23.4495
7/15/20,23.3745
7/14/20,23.3933
7/13/20,23.517
7/10/20,23.5992
7/9/20,23.617
7/8/20,23.5221
7/7/20,23.7059
7/6/20,23.5891
7/3/20,23.7169
7/2/20,23.6638
7/1/20,23.655
6/30/20,23.7371
6/29/20,23.8226
6/26/20,23.8484
6/25/20,23.8027
6/24/20,23.7538
6/23/20,23.5373
6/22/20,23.6847
6/19/20,23.8572
6/18/20,23.808
6/17/20,23.652
6/16/20,23.634
6/15/20,23.5354
6/12/20,23.7543
6/11/20,23.6835
6/10/20,23.3576
6/9/20,23.4226
6/8/20,23.5379
6/5/20,23.5685
6/4/20,23.5309
6/3/20,23.689
6/2/20,23.7979
6/1/20,24.0155
5/29/20,24.28
5/28/20,24.3902
5/27/20,24.6394
5/26/20,24.6115
5/25/20,24.9971
5/22/20,25.0245
5/21/20,24.7556
5/20/20,24.8788
5/19/20,25.1725
5/18/20,25.3265
5/15/20,25.6359
5/14/20,25.5405
5/13/20,25.389
5/12/20,25.3077
5/11/20,25.4557
5/8/20,25.1073
5/7/20,25.1407
5/6/20,25.1235
5/5/20,24.939
5/4/20,24.8152
5/1/20,24.8077
4/30/20,24.7479
4/29/20,24.9277
4/28/20,25.1217
4/27/20,25.1975
4/24/20,25.1188
4/23/20,25.5248
4/22/20,25.5202
4/21/20,25.3051
4/20/20,25.2403
4/17/20,25.052
4/16/20,25.0699
4/15/20,24.729
4/14/20,24.4441
4/13/20,24.6239
4/10/20,24.6495
4/9/20,24.7109
4/8/20,25.0225
4/7/20,24.926
4/6/20,25.5535
4/3/20,25.7085
4/2/20,25.3543
4/1/20,25.076
3/31/20,24.8
3/30/20,24.762
3/27/20,24.556
3/26/20,24.6309
3/25/20,25.2431
3/24/20,25.69
3/23/20,25.9096
3/20/20,25.5328
3/19/20,25.982
3/18/20,25.4673
3/17/20,24.6704
3/16/20,24.4905
3/13/20,23.6225
3/12/20,23.4195
3/11/20,22.888
3/10/20,22.7335
3/9/20,22.333