﻿Date,XAU,XAG,XPT,XPD,HG1
2021-03-24,1729.19,25.1571,1166.23,2604.17,
2021-03-23,1727.07,25.0608,1168.14,2609.66,408.8
2021-03-22,1739.03,25.7505,1186.85,2622.67,414.9
2021-03-19,1745.23,26.2461,1197.86,2640.31,412.35
2021-03-18,1736.42,26.0718,1209.74,2683.68,411.7
2021-03-17,1745.33,26.3165,1215.64,2573.99,412.8
2021-03-16,1731.4,25.9354,1216.25,2494.05,407.9
2021-03-15,1731.67,26.2422,1216.88,2391.25,414.65
2021-03-12,1727.11,25.9187,1205.8,2375.58,414.55
2021-03-11,1722.6,26.1219,1200.71,2352.5,414.3
2021-03-10,1726.71,26.2127,1205.43,2317.4,404.2
2021-03-09,1716.1,25.936,1173.39,2308,401.95
2021-03-08,1683.54,25.1275,1140.29,2323.25,410.35
2021-03-05,1700.64,25.2463,1132.78,2341.26,408.7
2021-03-04,1697.52,25.3548,1129.55,2341.98,399.1
2021-03-03,1711.23,26.0955,1167.41,2355.81,415.3
2021-03-02,1738.36,26.7633,1207.6,2375.5,423.15
2021-03-01,1725.04,26.571,1188.19,2361.4,411.95
2021-02-26,1734.04,26.6677,1193.02,2327.25,409.45
2021-02-25,1770.56,27.4258,1219.35,2409.13,426.6
2021-02-24,1805.06,27.9528,1269.84,2442.57,429.45
2021-02-23,1805.73,27.6737,1243.08,2354.09,417.85
2021-02-22,1809.67,28.1379,1275.95,2406.81,414.1
2021-02-19,1784.25,27.2899,1276.22,2385.32,407.4
2021-02-18,1775.67,27.0333,1275.82,2358.75,390.1
2021-02-17,1776.13,27.3829,1254.99,2373.34,382.05
2021-02-16,1794.47,27.243,1265.21,2392.33,383.4
2021-02-15,1818.86,27.6176,1305.33,2390.74,378.8
2021-02-12,1824.23,27.36,1256.38,2386.19,377.15
2021-02-11,1825.51,26.9824,1237.68,2351.5,377.25
2021-02-10,1842.89,27.0266,1246.21,2368.11,372
2021-02-09,1838.32,27.2674,1181.38,2330,366.6
2021-02-08,1830.81,27.2725,1161.74,2341.01,362.6
2021-02-05,1814.11,26.9205,1128.93,2348.56,355.3
2021-02-04,1794.03,26.3516,1101.45,2291.04,356.55
2021-02-03,1834.04,26.8915,1105.67,2280.21,352.45
2021-02-02,1838.03,26.6814,1098.27,2248.07,354.6
2021-02-01,1860.78,29.0515,1132.58,2253.77,355.6
2021-01-29,1847.65,26.9872,1078.02,2234.2,357.8
2021-01-28,1843.17,26.5025,1077.43,2340.97,355.75
2021-01-27,1843.98,25.2666,1068.68,2310.93,361.95
2021-01-26,1850.92,25.4699,1102.68,2328.75,362.95
2021-01-25,1855.93,25.3475,1100.85,2342.33,362.6
2021-01-22,1855.61,25.4935,1103.22,2361.01,364.75
2021-01-21,1870.02,25.9365,1130.71,2369.8,364.15
2021-01-20,1871.84,25.8425,1113.75,2374.34,363.35
2021-01-19,1840.28,25.2249,1088.87,2362.52,360.2
2021-01-18,1841.26,25.3544,1085.5,2372.22,366.45
2021-01-15,1828.45,24.7693,1075.24,2389.84,361.7
2021-01-14,1846.53,25.5192,1122.21,2411.2,360.55
2021-01-13,1845.51,25.2225,1099.19,2393.94,356.45
2021-01-12,1854.77,25.5597,1077.3,2401.85,367.35
2021-01-11,1843.89,24.9125,1035.56,2369.18,369.6
2021-01-08,1849.01,25.4234,1069.27,2376.88,365.05
2021-01-07,1913.95,27.1407,1119.55,2429.01,363.95
2021-01-06,1918.61,27.29,1104.8,2444.01,355.45
2021-01-05,1950.01,27.5525,1113.58,2470.7,351.9
2021-01-04,1942.9,27.235,1073.81,2383.27,354.9
2021-01-01,1898.67,26.4011,1072.02,2448.81,355.3
2020-12-31,1898.36,26.4023,1072.12,2448.81,357
2020-12-30,1894.39,26.6669,1072.02,2365.29,356
2020-12-29,1878.18,26.2125,1052.5,2342.87,355.2
2020-12-28,1873.69,26.2456,1034.27,2338.6,351.8
2020-12-24,1883.46,25.8297,1026.12,2341.98,357.3
2020-12-23,1872.89,25.542,1025.97,2344.66,362.85
2020-12-22,1860.84,25.1869,1019.55,2335.56,359.7
2020-12-21,1876.89,26.1697,1005.93,2316.88,355.4
2020-12-18,1881.35,25.8112,1012.6,2318,353.8
2020-12-17,1885.42,26.0624,1042.34,2363.49,352.2
2020-12-16,1864.8,25.3279,1048.85,2345.04,352.4
2020-12-15,1853.64,24.4945,1037.2,2334.05,357.05
2020-12-14,1827.35,23.8388,1040.75,2320.63,350.8
2020-12-11,1839.85,23.9505,1010.72,2301.99,349.4
2020-12-10,1836.57,24.0014,1012.79,2321.75,350.85
2020-12-09,1839.55,23.9495,1031.12,2341.21,351.4
2020-12-08,1870.56,24.554,1003.75,2272.96,347.9
2020-12-07,1862.73,24.4851,1028.77,2319.69,347.5
2020-12-04,1838.86,24.185,1024.79,2342.4,346.8
2020-12-03,1841.08,24.065,1060.62,2352.44,342.05
2020-12-02,1831.28,24.1028,1033.1,2319.47,339.95
2020-12-01,1815.24,24.0021,1016.43,2411.63,330.95
2020-11-30,1776.95,22.644,1003.3,2417.53,329.95
2020-11-27,1787.79,22.5739,967.87,2382.29,325.8
2020-11-26,1815.8,23.4193,967.8,2428.47,329.1
2020-11-25,1807.56,23.3568,965.6,2389.4,320.2
2020-11-24,1807.59,23.269,967.33,2340.73,319.8
2020-11-23,1837.86,23.5957,962.7,2352.78,319.8
2020-11-20,1870.99,24.1759,930.3,2351.41,322.2
2020-11-19,1866.54,24.0519,950.4,2329.28,317.8
2020-11-18,1872.24,24.3365,952.74,2325.42,314.5
2020-11-17,1880.38,24.491,944.66,2337.6,313.4
2020-11-16,1888.95,24.7705,929.83,2322.25,315.55
2020-11-13,1889.2,24.67,929.32,2335.55,315.6
2020-11-12,1876.83,24.2818,894.41,2325.51,315.4
2020-11-11,1865.73,24.2778,883.59,2340.56,311
2020-11-10,1877.32,24.234,868.63,2320.57,310.7
2020-11-09,1863.04,24.106,887.55,2464.92,309.25
2020-11-06,1951.35,25.612,870.08,2487.45,307.7
2020-11-05,1949.66,25.374,895.64,2495.88,304.75
2020-11-04,1902.92,23.9011,896.77,2384.9,305.65
2020-11-03,1909.17,24.2258,871.8,2295.37,306.4
2020-11-02,1895.48,24.089,873.64,2294.88,309.35
2020-10-30,1878.81,23.6567,862.33,2219.38,308.95
2020-10-29,1867.59,23.2585,847.46,2215.88,312.9
2020-10-28,1877.19,23.3848,848.98,2201.2,315.35
2020-10-27,1907.99,24.373,870.7,2248.42,319.85
2020-10-26,1902.08,24.2802,882.94,2338.59,314.8
2020-10-23,1902.05,24.607,874.61,2363.9,308.6
2020-10-22,1904.11,24.7088,905.01,2397.76,306.75
2020-10-21,1924.33,25.0472,886,2386.3,308.55
2020-10-20,1906.95,24.6418,890.81,2412.24,305.05
2020-10-19,1904.08,24.3889,875.8,2404.9,304.45
2020-10-16,1899.29,24.1577,860.11,2345.46,306.4
2020-10-15,1908.71,24.3018,864.85,2335.21,308.25
2020-10-14,1901.52,24.2653,866.57,2361.93,304.2
2020-10-13,1891.36,24.1385,861.92,2352.98,303.3
2020-10-12,1922.77,25.103,868.76,2322.34,296.35
2020-10-09,1930.4,25.1539,877.42,2408.96,296.3
2020-10-08,1893.82,23.8382,892.83,2440.91,297.75
2020-10-07,1887.42,23.8029,867.23,2379.42,286.55
2020-10-06,1878.18,23.0675,867.79,2360.73,303.25
2020-10-05,1913.53,24.38,855.75,2344.96,299
2020-10-02,1899.84,23.7361,900.2,2365.86,298.95
2020-10-01,1906.01,23.7929,881.34,2311.73,297.3
2020-09-30,1885.82,23.2352,899.17,2329.87,296.9
2020-09-29,1898.07,24.189,893.2,2310.77,299.35
2020-09-28,1881.48,23.6753,886.92,2322.14,305.9
2020-09-25,1861.58,22.8885,882.53,2262.12,302.95
2020-09-24,1868.07,23.1475,849.44,2228.29,311.35
2020-09-23,1863.34,22.7784,851.32,2237.58,306.65
2020-09-22,1900.21,24.399,843.61,2229.81,305.8
2020-09-21,1912.51,24.7156,870.41,2228.98,306.3
2020-09-18,1950.86,26.7845,886.35,2275.83,306.65
2020-09-17,1944.44,27.0364,931.2,2360.88,303.4
2020-09-16,1959.26,27.1595,939.68,2332.42,298.7
2020-09-15,1954.15,27.138,973.71,2398.83,304
2020-09-14,1956.86,27.1231,973.2,2401.36,301.25
2020-09-11,1940.55,26.73,957.65,2312.73,304.65
2020-09-10,1946.09,26.8771,930.83,2324.35,295.8
2020-09-09,1946.84,26.9798,930.7,2300.73,300.3
2020-09-08,1932.03,26.6705,921.66,2302.91,300.95
2020-09-07,1933.64,26.8322,902.69,2289.25,304.1
2020-09-04,1933.94,26.9105,911,2303.57,299.5
2020-09-03,1930.91,26.586,904.05,2295.22,296.75
2020-09-02,1942.92,27.4475,892.2,2306.97,296.15
2020-09-01,1970.18,28.111,907.55,2247.64,293.4
2020-08-31,1967.8,28.1428,946.75,2279.16,292.65
2020-08-28,1964.83,27.503,931.73,2246.38,291.75
2020-08-27,1929.54,27.0161,932.83,2209.1,297.45
2020-08-26,1954.46,27.4998,926.24,2179.19,302.3
2020-08-25,1928.18,26.5342,936.73,2188.86,297.5
2020-08-24,1928.88,26.605,930.84,2172.84,290.15
2020-08-21,1940.48,26.7905,919.59,2167.02,285.9
2020-08-20,1947.26,27.248,922.31,2182.73,280.7
2020-08-19,1928.98,26.7005,921.61,2184,289.1
2020-08-18,2002.44,27.6715,932.83,2155.96,287.55
2020-08-17,1985.3,27.486,961.2,2202.61,286.15
2020-08-14,1945.12,26.4463,957.81,2202.95,279.25
2020-08-13,1953.71,27.505,944.42,2121.21,291.05
2020-08-12,1915.83,25.512,960.19,2179.08,291.7
2020-08-11,1911.89,24.7931,931.41,2137.46,289.45
2020-08-10,2027.34,29.1295,931.25,2095.24,291.2
2020-08-07,2035.55,28.3009,986.05,2233.25,286.8
2020-08-06,2063.54,28.9215,966.62,2176.38,291.4
2020-08-05,2038.12,26.9588,997.13,2230.65,290.55
2020-08-04,2019.21,26.006,969.76,2188.14,290.5
2020-08-03,1976.98,24.2996,938.4,2141.51,288.8
2020-07-31,1975.86,24.389,921.02,2095.14,288.2
2020-07-30,1956.64,23.4975,905.13,2090.77,292.45
2020-07-29,1970.79,24.309,908,2088.29,290.85
2020-07-28,1958.43,24.402,934.7,2178.82,294.1
2020-07-27,1942.24,24.5882,954.93,2286.2,289.85
2020-07-24,1902.02,22.7664,946.53,2310.33,288.75
2020-07-23,1887.44,22.59,918.9,2227.04,288.6
2020-07-22,1871.41,22.996,920.18,2155.25,287.05
2020-07-21,1841.91,21.3037,924.48,2156.76,291.6
2020-07-20,1817.77,19.9084,883.3,2144.79,294.2
2020-07-17,1810.42,19.3274,849.71,2050.5,288.7
2020-07-16,1797.16,19.156,840.24,2020.36,282.8
2020-07-15,1810.29,19.4168,825.16,1990.87,281.45
2020-07-14,1809.36,19.2164,832.61,1979.03,278.75
2020-07-13,1802.76,19.0751,829.31,1974.04,276.6
2020-07-10,1798.7,18.7202,834.5,1995.28,273.35
2020-07-09,1803.55,18.6505,827.53,1969.31,271.7
2020-07-08,1808.89,18.7204,837.68,1949.3,271.35
2020-07-07,1794.86,18.2726,850.52,1925.6,267.95
2020-07-06,1784.68,18.2727,839.86,1930.74,265.9
2020-07-03,1775.95,18.0214,826.52,1935.38,266.3
2020-07-02,1775.38,17.9566,810.75,1927.14,265.05
2020-07-01,1770.09,18.0119,813.77,1911.69,265.85
2020-06-30,1780.96,18.207,822.19,1923.75,265.25
2020-06-29,1772.82,17.8581,829.39,1943.7,261.1
2020-06-26,1771.29,17.805,815.05,1900.43,258.8
2020-06-25,1763.79,17.8025,805.75,1883.64,258.95
2020-06-24,1761.17,17.5011,805.5,1846.22,256.45
2020-06-23,1768.41,17.9449,804.57,1880.6,256.7
2020-06-22,1754.43,17.712,830.09,1931.65,260
2020-06-19,1743.87,17.6245,823.11,1943.56,258.65
2020-06-18,1722.93,17.383,814.77,1913.66,265.65
2020-06-17,1726.95,17.505,809.01,1908.17,259.9
2020-06-16,1726.53,17.4569,823.47,1931.05,256.55
2020-06-15,1725.16,17.3828,825.08,1938.04,255.55
2020-06-12,1730.75,17.4916,820.63,1937.35,248.95
2020-06-11,1727.7,17.6515,813.26,1931.32,248.75
2020-06-10,1738.7,18.114,814.7,1940.59,249.1
2020-06-09,1715.33,17.5337,841.77,1954.68,247.05
2020-06-08,1698.53,17.774,836.5,1953.8,242.55
2020-06-05,1685.06,17.415,838.03,2009.08,241.35
2020-06-04,1714.01,17.7109,819.55,1952.29,240.25
2020-06-03,1699.67,17.652,842.28,1936.99,243.85
2020-06-02,1727.7,18.068,834.61,1946.63,240.9
2020-06-01,1739.55,18.3031,846.21,1975,245.2
2020-05-29,1730.27,17.8655,850.91,1960.9,246.75
2020-05-28,1718.33,17.371,837.97,1939.39,242.3
2020-05-27,1709.47,17.2601,838.92,1936.72,240.5
2020-05-26,1710.58,17.1349,840.13,1944.08,233.35
2020-05-25,1731.95,17.2875,833.41,1955.9,235.1
2020-05-22,1734.68,17.2133,849.45,1995.65,234.9
2020-05-21,1727,17.108,835.73,1964.98,236.05
2020-05-20,1748.18,17.5567,837.65,2036.41,238.2
2020-05-19,1745.05,17.3495,867.14,2101.25,240.85
2020-05-18,1732.55,16.966,836.62,2023.88,238.55
2020-05-15,1743.67,16.6109,818.63,1997.65,235.25
2020-05-14,1730.3,15.8734,789.47,1881.85,234.1
2020-05-13,1716.28,15.5813,772.33,1843.91,232.4
2020-05-12,1702.7,15.449,764.82,1832.1,231.85
2020-05-11,1697.93,15.4901,764.61,1855.24,235.4
2020-05-08,1702.7,15.4815,768.02,1899.75,237.45
2020-05-07,1716.06,15.3457,771.76,1892.06,234.55
2020-05-06,1685.71,14.8528,766.87,1863.65,235
2020-05-05,1705.92,14.9637,753.41,1803.9,233.7
2020-05-04,1702.07,14.7781,769.36,1807.27,231.2
2020-05-01,1700.42,14.9765,768,1858.67,229
2020-04-30,1686.5,14.9697,766.16,1917.84,222.95
2020-04-29,1713.41,15.2964,777.11,1970.79,232
2020-04-28,1707.79,15.1654,781.05,1949.69,234.45
2020-04-27,1713.99,15.2089,772.36,1915.54,229.1
2020-04-24,1729.6,15.2535,765.72,1931.64,229.6
2020-04-23,1730.51,15.2554,768.63,2034,232.95
2020-04-22,1714.08,15.097,766.32,1976.99,230.25
2020-04-21,1686.2,14.8865,758.85,1939.87,225.95
2020-04-20,1695.65,15.317,749.27,1933.38,226
2020-04-17,1682.82,15.178,774.18,2171.22,227.25
2020-04-16,1717.7,15.4965,776.65,2166.32,221.75
2020-04-15,1717.03,15.4635,789.83,2170.91,219.25
2020-04-14,1726.97,15.7519,777.88,2179.46,221.85
2020-04-13,1715.34,15.4145,781.2,2230.14,217.45
2020-04-10,1696.65,15.5651,751.75,2211.5,222.8
2020-04-09,1683.73,15.4325,750.29,2177.56,215.55
2020-04-08,1646.14,14.9601,750.76,2164.85,219.7
2020-04-07,1647.72,15.0209,732.73,2168.05,220.8
2020-04-06,1660.97,15.0037,739.06,2183.34,223.4
2020-04-03,1620.81,14.3881,740.47,2163.55,219.75
2020-04-02,1613.99,14.4888,725.13,2164.1,211.95
2020-04-01,1591.51,13.9625,730.97,2229.85,219.05
2020-03-31,1577.18,13.974,720.75,2226.85,220
2020-03-30,1622.51,14.0487,723.09,2363.11,216.05
2020-03-27,1628.16,14.4683,728.2,2325.63,231.55
2020-03-26,1631.34,14.4055,744.77,2265.37,239.85
2020-03-25,1616.9,14.4763,739.13,2339.91,247.4
2020-03-24,1632.32,14.2808,742.16,2352.41,248.1
2020-03-23,1553.23,13.265,712.85,1948.98,251.2