﻿Date,CL1,CO1,NG1
2021-03-24,57.78,60.88,2.516
2021-03-23,57.76,60.79,2.508
2021-03-22,61.55,64.62,2.582
2021-03-19,61.42,64.53,2.535
2021-03-18,60,63.28,2.481
2021-03-17,64.6,68,2.528
2021-03-16,64.8,68.39,2.562
2021-03-15,65.39,68.88,2.484
2021-03-12,65.61,69.22,2.6
2021-03-11,66.02,69.63,2.668
2021-03-10,64.44,67.9,2.692
2021-03-09,64.01,67.52,2.662
2021-03-08,65.05,68.24,2.664
2021-03-05,66.09,69.36,2.701
2021-03-04,63.83,66.74,2.746
2021-03-03,61.28,64.07,2.816
2021-03-02,59.75,62.7,2.839
2021-03-01,60.64,63.69,2.777
2021-02-26,61.5,66.13,2.771
2021-02-25,63.53,66.88,2.777
2021-02-24,63.22,67.04,2.854
2021-02-23,61.67,65.37,2.879
2021-02-22,61.49,65.24,2.953
2021-02-19,59.24,62.91,3.069
2021-02-18,60.52,63.93,3.082
2021-02-17,61.14,64.34,3.219
2021-02-16,60.05,63.35,3.129
2021-02-12,59.47,63.3,2.912
2021-02-11,58.24,62.43,2.868
2021-02-10,58.68,61.14,2.911
2021-02-09,58.36,61.47,2.835
2021-02-08,57.97,61.09,2.882
2021-02-05,56.85,60.56,2.863
2021-02-04,56.23,59.34,2.935
2021-02-03,55.69,58.84,2.789
2021-02-02,54.76,58.46,2.845
2021-02-01,53.55,57.46,2.85
2021-01-29,52.2,56.35,2.564
2021-01-28,52.34,55.88,2.664
2021-01-27,52.85,55.53,2.76
2021-01-26,52.61,55.81,2.656
2021-01-25,52.77,55.91,2.602
2021-01-22,52.27,55.88,2.446
2021-01-21,53.13,55.41,2.491
2021-01-20,53.24,56.1,2.539
2021-01-19,52.98,56.08,2.546
2021-01-15,52.36,55.9,2.737
2021-01-14,53.57,54.75,2.666
2021-01-13,52.91,55.1,2.727
2021-01-12,53.21,56.42,2.753
2021-01-11,52.25,56.06,2.747
2021-01-08,52.24,56.58,2.7
2021-01-07,50.83,55.66,2.729
2021-01-06,50.63,55.99,2.716
2021-01-05,49.93,54.38,2.702
2021-01-04,47.62,54.3,2.581
2020-12-31,48.52,53.6,2.539
2020-12-30,48.4,51.09,2.422
2020-12-29,48,51.8,2.467
2020-12-28,47.62,51.34,2.305
2020-12-24,48.23,51.09,2.518
2020-12-23,48.12,50.86,2.608
2020-12-22,47.02,51.29,2.78
2020-12-21,47.74,51.2,2.705
2020-12-18,49.1,50.08,2.7
2020-12-17,48.36,50.91,2.636
2020-12-16,47.82,52.26,2.677
2020-12-15,47.62,51.5,2.682
2020-12-14,46.99,51.08,2.682
2020-12-11,46.57,50.76,2.591
2020-12-10,46.78,50.29,2.553
2020-12-09,45.52,49.97,2.442
2020-12-08,45.6,50.25,2.399
2020-12-07,45.76,48.86,2.406
2020-12-04,46.26,48.84,2.575
2020-12-03,45.64,48.79,2.507
2020-12-02,45.28,49.25,2.78
2020-12-01,44.55,48.71,2.88
2020-11-30,45.34,48.25,2.882
2020-11-27,45.53,47.42,2.843
2020-11-25,45.71,47.59,2.896
2020-11-24,44.91,48.18,2.775
2020-11-23,43.06,47.8,2.711
2020-11-20,42.15,48.61,2.65
2020-11-19,41.74,47.86,2.592
2020-11-18,41.82,46.06,2.712
2020-11-17,41.43,44.96,2.692
2020-11-16,41.34,44.2,2.697
2020-11-13,40.13,44.34,2.995
2020-11-12,41.12,43.75,2.976
2020-11-11,41.45,43.82,3.031
2020-11-10,41.36,42.78,2.949
2020-11-09,40.29,43.53,2.859
2020-11-06,37.14,43.8,2.888
2020-11-05,38.79,43.61,2.942
2020-11-04,39.15,42.4,3.046
2020-11-03,37.66,39.45,3.059
2020-11-02,36.81,40.93,3.244
2020-10-30,35.79,41.23,3.354
2020-10-29,36.17,39.71,3.301
2020-10-28,37.39,38.97,2.996
2020-10-27,39.57,37.46,3.019
2020-10-26,38.56,37.65,3.024
2020-10-23,39.85,39.12,2.971
2020-10-22,40.64,41.2,3.007
2020-10-21,40.03,40.46,3.023
2020-10-20,41.46,41.77,2.913
2020-10-19,40.83,42.46,2.795
2020-10-16,40.88,41.73,2.773
2020-10-15,40.96,43.16,2.775
2020-10-14,41.04,42.62,2.636
2020-10-13,40.2,42.93,2.855
2020-10-12,39.43,43.16,2.881
2020-10-09,40.6,43.32,2.741
2020-10-08,41.19,42.45,2.627
2020-10-07,39.95,41.72,2.606
2020-10-06,40.67,42.85,2.52
2020-10-05,39.22,43.34,2.615
2020-10-02,37.05,41.99,2.438
2020-10-01,38.72,42.65,2.527
2020-09-30,40.22,41.29,2.527
2020-09-29,39.29,39.27,2.561
2020-09-28,40.6,40.93,2.101
2020-09-25,40.25,40.95,2.139
2020-09-24,40.31,41.03,2.248
2020-09-23,39.93,42.43,2.125
2020-09-22,39.6,41.92,1.834
2020-09-21,39.31,41.94,1.835
2020-09-18,41.11,41.77,2.048
2020-09-17,40.97,41.72,2.042
2020-09-16,40.16,41.44,2.267
2020-09-15,38.28,43.15,2.362
2020-09-14,37.26,43.3,2.31
2020-09-11,37.33,42.22,2.269
2020-09-10,37.3,40.53,2.323
2020-09-09,38.05,39.61,2.406
2020-09-08,36.76,39.83,2.4
2020-09-04,39.77,40.06,2.588
2020-09-03,41.37,40.79,2.487
2020-09-02,41.51,39.78,2.486
2020-09-01,42.76,42.01,2.527
2020-08-31,42.61,42.66,2.63
2020-08-28,42.97,44.07,2.657
2020-08-27,43.04,44.43,2.579
2020-08-26,43.39,45.58,2.461
2020-08-25,43.35,45.28,2.489
2020-08-24,42.62,45.05,2.513
2020-08-21,42.34,45.09,2.448
2020-08-20,42.58,45.64,2.352
2020-08-19,42.93,45.86,2.426
2020-08-18,42.89,45.13,2.417
2020-08-17,42.89,44.35,2.339
2020-08-14,42.01,44.9,2.356
2020-08-13,42.24,45.37,2.182
2020-08-12,42.67,45.46,2.152
2020-08-11,41.61,45.37,2.171
2020-08-10,41.94,44.8,2.153
2020-08-07,41.22,44.96,2.238
2020-08-06,41.95,45.43,2.165
2020-08-05,42.19,44.5,2.191
2020-08-04,41.7,44.99,2.193
2020-08-03,41.01,44.4,2.101
2020-07-31,40.27,45.09,1.799
2020-07-30,39.92,45.17,1.829
2020-07-29,41.27,44.43,1.854
2020-07-28,41.04,44.15,1.8
2020-07-27,41.6,43.3,1.734
2020-07-24,41.29,42.94,1.808
2020-07-23,41.07,43.75,1.785
2020-07-22,41.9,43.22,1.681
2020-07-21,41.96,43.41,1.675
2020-07-20,40.81,43.34,1.641
2020-07-17,40.59,43.31,1.718
2020-07-16,40.75,44.29,1.723
2020-07-15,41.2,44.32,1.778
2020-07-14,40.29,43.28,1.746
2020-07-13,40.1,43.14,1.739
2020-07-10,40.55,43.37,1.805
2020-07-09,39.62,43.79,1.779
2020-07-08,40.9,42.9,1.824
2020-07-07,40.62,42.72,1.876
2020-07-06,40.63,43.24,1.83
2020-07-02,40.65,42.35,1.734
2020-07-01,39.82,43.29,1.671
2020-06-30,39.27,43.08,1.751
2020-06-29,39.7,43.1,1.709
2020-06-26,38.49,42.8,1.495
2020-06-25,38.72,43.14,1.482
2020-06-24,38.01,42.03,1.597
2020-06-23,40.37,41.15,1.637
2020-06-22,40.46,41.71,1.664
2020-06-19,39.75,41.02,1.669
2020-06-18,38.84,41.05,1.638
2020-06-17,37.96,40.31,1.638
2020-06-16,38.38,42.63,1.614
2020-06-15,37.12,43.08,1.669
2020-06-12,36.26,42.19,1.731
2020-06-11,36.34,41.51,1.813
2020-06-10,39.6,40.71,1.78
2020-06-09,38.94,40.96,1.767
2020-06-08,38.19,39.72,1.789
2020-06-05,39.55,38.73,1.782
2020-06-04,37.41,38.55,1.822
2020-06-03,37.29,41.73,1.821
2020-06-02,36.81,41.18,1.777
2020-06-01,35.44,40.8,1.774
2020-05-29,35.49,42.3,1.849
2020-05-28,33.71,39.99,1.827
2020-05-27,32.81,39.79,1.722
2020-05-26,34.35,39.57,1.793
2020-05-22,33.25,38.32,1.731
2020-05-21,33.92,35.33,1.71
2020-05-20,33.49,35.29,1.771
2020-05-19,32.5,34.74,1.83
2020-05-18,31.82,36.17,1.783
2020-05-15,29.43,35.53,1.646
2020-05-14,27.56,35.13,1.681
2020-05-13,25.29,36.06,1.616
2020-05-12,25.78,35.75,1.72
2020-05-11,24.14,34.65,1.826
2020-05-08,24.74,34.81,1.823
2020-05-07,23.55,32.5,1.894
2020-05-06,23.99,31.13,1.944
2020-05-05,24.56,29.19,2.134
2020-05-04,20.39,29.98,1.993
2020-05-01,19.78,29.63,1.89
2020-04-30,18.84,30.97,1.949
2020-04-29,15.06,29.46,1.869
2020-04-28,12.34,29.72,1.794
2020-04-27,12.78,30.97,1.819
2020-04-24,16.94,27.2,1.746
2020-04-23,16.5,26.44,1.815
2020-04-22,13.78,25.27,1.939
2020-04-21,10.01,22.54,1.821
2020-04-20,-37.63,20.46,1.924
2020-04-17,18.27,19.99,1.753
2020-04-16,19.87,21.44,1.686
2020-04-15,19.87,21.33,1.598
2020-04-14,20.11,20.37,1.65
2020-04-13,22.41,19.33,1.724
2020-04-09,22.76,25.57,1.733
2020-04-08,25.09,28.08,1.783
2020-04-07,23.63,27.82,1.852
2020-04-06,26.08,27.69,1.731
2020-04-03,28.34,29.6,1.621
2020-04-02,25.32,31.74,1.552
2020-04-01,20.31,31.48,1.587
2020-03-31,20.48,32.84,1.64
2020-03-30,20.09,31.87,1.69
2020-03-27,21.51,33.05,1.634
2020-03-26,22.6,34.11,1.637
2020-03-25,24.49,29.94,1.659
2020-03-24,24.01,24.74,1.653
2020-03-23,23.36,22.74,1.602
2020-03-20,22.43,22.76,1.604
2020-03-19,25.22,24.93,1.654
2020-03-18,20.37,26.34,1.604
2020-03-17,26.95,27.39,1.729
2020-03-16,28.7,27.15,1.815
2020-03-13,31.73,27.03,1.869
2020-03-12,31.5,26.98,1.841
2020-03-11,32.98,28.47,1.878
2020-03-10,34.36,24.88,1.936
2020-03-09,31.13,28.73,1.778
2020-03-06,41.28,30.05,1.708
2020-03-05,45.9,33.85,1.772
2020-03-04,46.78,33.22,1.827
2020-03-03,47.18,35.79,1.8
2020-03-02,46.75,37.22,1.756