﻿Date,Last Price
3/8/21,8.5455
3/5/21,8.5522
3/4/21,8.5799
3/3/21,8.5033
3/2/21,8.4749
3/1/21,8.5573
2/26/21,8.6661
2/25/21,8.494
2/24/21,8.3766
2/23/21,8.4691
2/22/21,8.4914
2/19/21,8.4699
2/18/21,8.4623
2/17/21,8.5015
2/16/21,8.4377
2/15/21,8.3903
2/12/21,8.4622
2/11/21,8.4765
2/10/21,8.4641
2/9/21,8.4494
2/8/21,8.5013
2/5/21,8.5289
2/4/21,8.637
2/3/21,8.5856
2/2/21,8.6029
2/1/21,8.6088
1/29/21,8.5649
1/28/21,8.5976
1/27/21,8.6547
1/26/21,8.5455
1/25/21,8.5353
1/22/21,8.4951
1/21/21,8.4135
1/20/21,8.4937
1/19/21,8.542
1/18/21,8.5959
1/15/21,8.5689
1/14/21,8.4638
1/13/21,8.473
1/12/21,8.4488
1/11/21,8.537
1/8/21,8.4199
1/7/21,8.4271
1/6/21,8.4116
1/5/21,8.4677
1/4/21,8.5556
1/1/21,8.5753
12/31/20,8.5791
12/30/20,8.5401
12/29/20,8.6199
12/28/20,8.6362
12/25/20,8.628
12/24/20,8.6621
12/23/20,8.6447
12/22/20,8.7427
12/21/20,8.6503
12/18/20,8.583
12/17/20,8.5632
12/16/20,8.6723
12/15/20,8.7168
12/14/20,8.7517
12/11/20,8.8172
12/10/20,8.7777
12/9/20,8.8357
12/8/20,8.7666
12/7/20,8.7427
12/4/20,8.8002
12/3/20,8.7649
12/2/20,8.8
12/1/20,8.8041
11/30/20,8.8781
11/27/20,8.8356
11/26/20,8.8787
11/25/20,8.8282
11/24/20,8.9074
11/23/20,9.033
11/20/20,9.013
11/19/20,9.0004
11/18/20,9.0175
11/17/20,9.0711
11/16/20,9.057
11/13/20,9.1658
11/12/20,9.1737
11/11/20,9.0924
11/10/20,9.0145
11/9/20,9.044
11/6/20,9.1567
11/5/20,9.2096
11/4/20,9.3348
11/3/20,9.3846
11/2/20,9.56
10/30/20,9.5362
10/29/20,9.5424
10/28/20,9.3708
10/27/20,9.1754
10/26/20,9.2446
10/23/20,9.2378
10/22/20,9.2535
10/21/20,9.2195
10/20/20,9.2838
10/19/20,9.319
10/16/20,9.379
10/15/20,9.3483
10/14/20,9.2412
10/13/20,9.237
10/12/20,9.1376
10/9/20,9.1372
10/8/20,9.2616
10/7/20,9.2989
10/6/20,9.3638
10/5/20,9.2159
10/2/20,9.3163
10/1/20,9.3011
9/30/20,9.3324
9/29/20,9.4214
9/28/20,9.4805
9/25/20,9.5737
9/24/20,9.4951
9/23/20,9.4917
9/22/20,9.3458
9/21/20,9.277
9/18/20,9.0942
9/17/20,9.0481
9/16/20,9.0209
9/15/20,9.0309
9/14/20,9.0345
9/11/20,9.0371
9/10/20,9.0761
9/9/20,9.0189
9/8/20,9.1305
9/7/20,8.933
9/4/20,8.9283
9/3/20,8.9179
9/2/20,8.8387
9/1/20,8.7607
8/31/20,8.724
8/28/20,8.8424
8/27/20,8.9151
8/26/20,8.8897
8/25/20,8.9564
8/24/20,8.998
8/21/20,9.0123
8/20/20,8.9207
8/19/20,8.9288
8/18/20,8.8463
8/17/20,8.8504
8/14/20,8.89
8/13/20,8.8827
8/12/20,8.9445
8/11/20,9.0208
8/10/20,9.0352
8/7/20,9.0401
8/6/20,8.9689
8/5/20,8.9516
8/4/20,9.1166
8/3/20,9.1312
7/31/20,9.1022
7/30/20,9.0738
7/29/20,9.0282
7/28/20,9.1192
7/27/20,9.0944
7/24/20,9.1529
7/23/20,9.2273
7/22/20,9.0998
7/21/20,9.1135
7/20/20,9.2296
7/17/20,9.2935
7/16/20,9.2997
7/15/20,9.2718
7/14/20,9.4047
7/13/20,9.4555
7/10/20,9.4238
7/9/20,9.4681
7/8/20,9.3863
7/7/20,9.4907
7/6/20,9.3969
7/3/20,9.4747
7/2/20,9.532
7/1/20,9.5147
6/30/20,9.6251
6/29/20,9.6744
6/26/20,9.6979
6/25/20,9.6611
6/24/20,9.6647
6/23/20,9.517
6/22/20,9.6033
6/19/20,9.6461
6/18/20,9.5426
6/17/20,9.5287
6/16/20,9.5686
6/15/20,9.5378
6/12/20,9.6418
6/11/20,9.6142
6/10/20,9.3022
6/9/20,9.2784
6/8/20,9.2603
6/5/20,9.3152
6/4/20,9.3538
6/3/20,9.4572
6/2/20,9.5462
6/1/20,9.6109
5/29/20,9.7205
5/28/20,9.7758
5/27/20,9.8659
5/26/20,9.8892
5/25/20,10.0568
5/22/20,10.0001
5/21/20,9.9422
5/20/20,9.9059
5/19/20,9.9844
5/18/20,10.0285
5/15/20,10.2358
5/14/20,10.1529
5/13/20,10.1657
5/12/20,10.1751
5/11/20,10.3083
5/8/20,10.2212
5/7/20,10.2468
5/6/20,10.436
5/5/20,10.2619
5/4/20,10.3267
5/1/20,10.2987
4/30/20,10.2421
4/29/20,10.3222
4/28/20,10.4045
4/27/20,10.5113
4/24/20,10.6226
4/23/20,10.6378
4/22/20,10.7676
4/21/20,10.6509
4/20/20,10.4539
4/17/20,10.3271
4/16/20,10.4558
4/15/20,10.5083
4/14/20,10.308
4/13/20,10.3165
4/10/20,10.2023
4/9/20,10.2358
4/8/20,10.3049
4/7/20,10.2837
4/6/20,10.428
4/3/20,10.6091
4/2/20,10.3897
4/1/20,10.4551
3/31/20,10.4028
3/30/20,10.5466
3/27/20,10.486
3/26/20,10.4104
3/25/20,10.7297
3/24/20,11.1202
3/23/20,11.5817
3/20/20,11.7051
3/19/20,11.2472
3/18/20,11.2897
3/17/20,10.4996
3/16/20,10.2781
3/13/20,10.0778
3/12/20,10.1668
3/11/20,9.692
3/10/20,9.5942
3/9/20,9.5695