56,55,54,53,52,51,50,49,48,47,46,45,44,43,42,41,40,39,38,37,36,35,34,33,32,31,30,29,28,27,26,25,24,23,22,21,20,19,18,17,16,15,14,13,12,11,10,9,8,7,6,5,4,3,2,1
75_to_100_VO2Slope,DiffPeakVO2,StdVE/VCO2,15_to_85_RRSlope,PeakVE,75_to_100_HRSlope,PeakHeartRate,PeakVCO2,HRvsVO2Slope,MeanHeartRate,PeakRR,75_to_100_RERSlope,MeanRER,75_to_100_VEVCO2Slope,LowestVE/VCO2,MeanVCO2,StdHeartRate,15_to_85_VEVCO2Slope,MeanVE,VO2atVT,15_to_85_VESlope,75_to_100_VESlope,PeakRER,15_to_85_HRSlope,75_to_100_O2Slope,PredictedMaxHR,75_to_100_RRSlope,15_to_85_O2Slope,75_to_100_VEVO2Slope,MeanVO2,VEvsVCO2Slope,15_to_85_VCO2Slope,PeakVO2Real,MinO2Pulse,15_to_85_RERSlope,MeanRR,15_to_85_VO2Slope,15_to_85_VEVO2Slope,MeanO2Pulse,MeanVE/VCO2,MaxO2Pulse,DiffPeakHR,MaxVO2_EST,75_to_100_VCO2Slope,StdO2Pulse,VO2vsPeakVO2atVT,LowestVCO2,LowestVO2,PeakVO2,LowestRR,LowestVE,LowestRER,DiffPeakRER,PeakVE/VCO2,MinHeartRate,HasAnaerobicThreshold
75_to_100_VO2Slope,DiffPeakVO2,PeakVE,StdVE/VCO2,15_to_85_RRSlope,75_to_100_RERSlope,75_to_100_HRSlope,PeakHeartRate,MeanVO2,MeanHeartRate,75_to_100_VESlope,MeanRER,PredictedMaxHR,15_to_85_VEVCO2Slope,VO2atVT,PeakVCO2,PeakVO2Real,75_to_100_VEVCO2Slope,MeanVE,HRvsVO2Slope,15_to_85_O2Slope,StdHeartRate,15_to_85_HRSlope,15_to_85_VO2Slope,15_to_85_VCO2Slope,MeanVE/VCO2,75_to_100_O2Slope,MeanO2Pulse,VEvsVCO2Slope,75_to_100_RRSlope,MeanVCO2,LowestVE/VCO2,75_to_100_VEVO2Slope,MeanRR,PeakRER,PeakRR,MaxVO2_EST,MinO2Pulse,15_to_85_RERSlope,15_to_85_VESlope,StdO2Pulse,75_to_100_VCO2Slope,15_to_85_VEVO2Slope,VO2vsPeakVO2atVT,DiffPeakHR,MaxO2Pulse,LowestVCO2,LowestVO2,PeakVO2,LowestRR,LowestVE,LowestRER,DiffPeakRER,PeakVE/VCO2,MinHeartRate,HasAnaerobicThreshold
75_to_100_VO2Slope,DiffPeakVO2,15_to_85_RRSlope,75_to_100_HRSlope,MeanHeartRate,PeakVE,StdVE/VCO2,75_to_100_RERSlope,HRvsVO2Slope,PredictedMaxHR,75_to_100_VEVCO2Slope,StdHeartRate,75_to_100_VESlope,MeanVE,MeanRER,15_to_85_VEVCO2Slope,VEvsVCO2Slope,LowestVE/VCO2,MeanVCO2,75_to_100_RRSlope,15_to_85_VESlope,15_to_85_O2Slope,VO2atVT,15_to_85_HRSlope,PeakVCO2,DiffPeakHR,MeanVE/VCO2,MeanRR,MeanO2Pulse,PeakRER,15_to_85_RERSlope,15_to_85_VCO2Slope,15_to_85_VO2Slope,PeakVO2Real,15_to_85_VEVO2Slope,MinO2Pulse,VO2vsPeakVO2atVT,75_to_100_O2Slope,75_to_100_VEVO2Slope,75_to_100_VCO2Slope,PeakRR,MaxO2Pulse,PeakHeartRate,StdO2Pulse,MeanVO2,MaxVO2_EST,HasAnaerobicThreshold,LowestVCO2,LowestVO2,PeakVO2,LowestRR,LowestVE,LowestRER,DiffPeakRER,PeakVE/VCO2,MinHeartRate
75_to_100_VO2Slope,DiffPeakVO2,75_to_100_HRSlope,PeakVE,StdVE/VCO2,15_to_85_RRSlope,MeanHeartRate,75_to_100_RERSlope,HRvsVO2Slope,VO2atVT,MeanRER,75_to_100_VEVCO2Slope,PeakVO2Real,PeakVCO2,StdHeartRate,LowestVE/VCO2,VEvsVCO2Slope,MeanVE,MeanVO2,PredictedMaxHR,MeanVCO2,75_to_100_VESlope,PeakRR,15_to_85_HRSlope,15_to_85_VESlope,15_to_85_VCO2Slope,75_to_100_RRSlope,MinO2Pulse,PeakHeartRate,MeanVE/VCO2,MeanO2Pulse,PeakRER,75_to_100_O2Slope,DiffPeakHR,15_to_85_O2Slope,15_to_85_VEVCO2Slope,MaxVO2_EST,MaxO2Pulse,MeanRR,75_to_100_VEVO2Slope,StdO2Pulse,VO2vsPeakVO2atVT,15_to_85_VEVO2Slope,15_to_85_RERSlope,75_to_100_VCO2Slope,15_to_85_VO2Slope,HasAnaerobicThreshold,LowestVCO2,LowestVO2,PeakVO2,LowestRR,LowestVE,LowestRER,DiffPeakRER,PeakVE/VCO2,MinHeartRate
DiffPeakVO2,75_to_100_VO2Slope,75_to_100_HRSlope,StdVE/VCO2,15_to_85_RRSlope,PeakVE,MeanHeartRate,75_to_100_VEVCO2Slope,HRvsVO2Slope,75_to_100_RERSlope,MeanVCO2,PeakVCO2,PredictedMaxHR,MeanVE,StdHeartRate,15_to_85_VEVCO2Slope,MeanRER,MinO2Pulse,75_to_100_O2Slope,15_to_85_VESlope,15_to_85_O2Slope,PeakRR,PeakRER,MeanO2Pulse,PeakVO2Real,15_to_85_HRSlope,LowestVE/VCO2,75_to_100_RRSlope,15_to_85_VCO2Slope,75_to_100_VEVO2Slope,MeanVO2,75_to_100_VESlope,MaxVO2_EST,PeakHeartRate,MeanRR,15_to_85_VO2Slope,75_to_100_VCO2Slope,MeanVE/VCO2,VO2atVT,15_to_85_VEVO2Slope,VEvsVCO2Slope,15_to_85_RERSlope,MaxO2Pulse,VO2vsPeakVO2atVT,DiffPeakHR,StdO2Pulse,HasAnaerobicThreshold,LowestVCO2,LowestVO2,PeakVO2,LowestRR,LowestVE,LowestRER,DiffPeakRER,PeakVE/VCO2,MinHeartRate
DiffPeakVO2,75_to_100_VO2Slope,75_to_100_HRSlope,15_to_85_RRSlope,MeanHeartRate,StdVE/VCO2,PredictedMaxHR,HRvsVO2Slope,MeanRER,75_to_100_VEVCO2Slope,75_to_100_RERSlope,StdHeartRate,MeanVE,VEvsVCO2Slope,PeakVE,MeanVE/VCO2,LowestVE/VCO2,15_to_85_O2Slope,15_to_85_VEVCO2Slope,15_to_85_VESlope,75_to_100_VESlope,DiffPeakHR,MeanVCO2,PeakVCO2,75_to_100_RRSlope,15_to_85_HRSlope,MeanRR,15_to_85_RERSlope,StdO2Pulse,MeanO2Pulse,15_to_85_VEVO2Slope,PeakVO2Real,PeakRER,75_to_100_O2Slope,PeakHeartRate,VO2atVT,MeanVO2,VO2vsPeakVO2atVT,PeakRR,75_to_100_VEVO2Slope,75_to_100_VCO2Slope,MinO2Pulse,15_to_85_VO2Slope,MaxO2Pulse,MaxVO2_EST,15_to_85_VCO2Slope,HasAnaerobicThreshold,LowestVCO2,LowestVO2,PeakVO2,LowestRR,LowestVE,LowestRER,DiffPeakRER,PeakVE/VCO2,MinHeartRate
DiffPeakVO2,75_to_100_VO2Slope,75_to_100_HRSlope,15_to_85_RRSlope,StdVE/VCO2,75_to_100_VEVCO2Slope,75_to_100_RERSlope,HRvsVO2Slope,MeanRER,MeanHeartRate,MeanVE,PredictedMaxHR,PeakVCO2,StdHeartRate,75_to_100_VESlope,15_to_85_VO2Slope,15_to_85_VESlope,VEvsVCO2Slope,MeanO2Pulse,PeakVE,VO2atVT,MeanVE/VCO2,15_to_85_VEVO2Slope,75_to_100_VEVO2Slope,MeanVCO2,StdO2Pulse,15_to_85_HRSlope,75_to_100_RRSlope,15_to_85_VEVCO2Slope,15_to_85_VCO2Slope,75_to_100_O2Slope,15_to_85_O2Slope,LowestVE/VCO2,75_to_100_VCO2Slope,PeakRR,PeakHeartRate,MaxO2Pulse,MaxVO2_EST,PeakRER,DiffPeakHR,MeanRR,MinO2Pulse,15_to_85_RERSlope,PeakVO2Real,VO2vsPeakVO2atVT,MeanVO2,LowestVCO2,LowestVO2,PeakVO2,LowestRR,LowestVE,LowestRER,DiffPeakRER,PeakVE/VCO2,MinHeartRate,HasAnaerobicThreshold
DiffPeakVO2,75_to_100_VO2Slope,75_to_100_HRSlope,15_to_85_RRSlope,StdVE/VCO2,75_to_100_VEVCO2Slope,75_to_100_RERSlope,HRvsVO2Slope,PeakVCO2,MeanVE,PredictedMaxHR,MeanHeartRate,StdHeartRate,PeakVE,MeanRER,75_to_100_VESlope,75_to_100_RRSlope,15_to_85_O2Slope,15_to_85_VESlope,MeanVCO2,75_to_100_O2Slope,MeanVE/VCO2,MeanRR,15_to_85_VEVCO2Slope,DiffPeakHR,15_to_85_RERSlope,15_to_85_HRSlope,MeanO2Pulse,LowestVE/VCO2,MinO2Pulse,VEvsVCO2Slope,MeanVO2,MaxO2Pulse,PeakRER,StdO2Pulse,VO2atVT,15_to_85_VEVO2Slope,PeakRR,15_to_85_VCO2Slope,75_to_100_VCO2Slope,75_to_100_VEVO2Slope,MaxVO2_EST,15_to_85_VO2Slope,PeakHeartRate,PeakVO2Real,VO2vsPeakVO2atVT,HasAnaerobicThreshold,LowestVCO2,LowestVO2,PeakVO2,LowestRR,LowestVE,LowestRER,DiffPeakRER,PeakVE/VCO2,MinHeartRate
DiffPeakVO2,75_to_100_VO2Slope,75_to_100_HRSlope,StdVE/VCO2,15_to_85_RRSlope,PeakVE,75_to_100_VEVCO2Slope,MeanRER,75_to_100_RERSlope,PeakVCO2,MeanHeartRate,StdHeartRate,PredictedMaxHR,MeanVE,HRvsVO2Slope,15_to_85_VESlope,15_to_85_VEVCO2Slope,PeakHeartRate,VO2atVT,MeanO2Pulse,15_to_85_O2Slope,MeanVCO2,15_to_85_RERSlope,15_to_85_VCO2Slope,PeakRER,MaxVO2_EST,VEvsVCO2Slope,75_to_100_VESlope,75_to_100_VCO2Slope,MeanRR,MeanVE/VCO2,MinO2Pulse,LowestVE/VCO2,PeakRR,75_to_100_O2Slope,DiffPeakHR,15_to_85_VEVO2Slope,75_to_100_VEVO2Slope,MeanVO2,15_to_85_VO2Slope,75_to_100_RRSlope,MaxO2Pulse,15_to_85_HRSlope,StdO2Pulse,VO2vsPeakVO2atVT,PeakVO2Real,HasAnaerobicThreshold,LowestVCO2,LowestVO2,PeakVO2,LowestRR,LowestVE,LowestRER,DiffPeakRER,PeakVE/VCO2,MinHeartRate
DiffPeakVO2,75_to_100_VO2Slope,75_to_100_HRSlope,StdVE/VCO2,75_to_100_VCO2Slope,MeanVCO2,PeakVE,LowestVE/VCO2,MeanRER,75_to_100_RERSlope,MeanHeartRate,PeakVCO2,PeakVO2Real,MeanVE/VCO2,75_to_100_O2Slope,15_to_85_RRSlope,75_to_100_VEVCO2Slope,MinO2Pulse,MeanVE,15_to_85_VESlope,HRvsVO2Slope,15_to_85_HRSlope,VEvsVCO2Slope,MeanO2Pulse,75_to_100_VEVO2Slope,75_to_100_VESlope,StdO2Pulse,VO2atVT,MaxVO2_EST,15_to_85_VEVO2Slope,PredictedMaxHR,75_to_100_RRSlope,15_to_85_VO2Slope,15_to_85_RERSlope,StdHeartRate,PeakRR,PeakHeartRate,PeakRER,MeanVO2,15_to_85_O2Slope,15_to_85_VEVCO2Slope,15_to_85_VCO2Slope,DiffPeakHR,MaxO2Pulse,MeanRR,VO2vsPeakVO2atVT,LowestVCO2,LowestVO2,PeakVO2,LowestRR,LowestVE,LowestRER,DiffPeakRER,PeakVE/VCO2,MinHeartRate,HasAnaerobicThreshold
75_to_100_VO2Slope,DiffPeakVO2,75_to_100_HRSlope,75_to_100_VCO2Slope,StdVE/VCO2,LowestVE/VCO2,PeakHeartRate,PeakVCO2,PeakVE,PeakVO2Real,MeanVO2,VEvsVCO2Slope,MeanHeartRate,MeanRER,15_to_85_VEVCO2Slope,15_to_85_RRSlope,75_to_100_RRSlope,MeanVE/VCO2,VO2atVT,75_to_100_RERSlope,StdHeartRate,75_to_100_VESlope,StdO2Pulse,MeanVE,PeakRR,75_to_100_O2Slope,75_to_100_VEVCO2Slope,HRvsVO2Slope,MinO2Pulse,PeakRER,PredictedMaxHR,MeanO2Pulse,VO2vsPeakVO2atVT,15_to_85_VESlope,15_to_85_VEVO2Slope,MeanVCO2,15_to_85_HRSlope,15_to_85_O2Slope,15_to_85_VCO2Slope,MeanRR,MaxO2Pulse,MaxVO2_EST,DiffPeakHR,15_to_85_VO2Slope,15_to_85_RERSlope,75_to_100_VEVO2Slope,HasAnaerobicThreshold,LowestVCO2,LowestVO2,PeakVO2,LowestRR,LowestVE,LowestRER,DiffPeakRER,PeakVE/VCO2,MinHeartRate
75_to_100_VO2Slope,DiffPeakVO2,PeakVE,15_to_85_RRSlope,75_to_100_HRSlope,MeanHeartRate,HRvsVO2Slope,StdVE/VCO2,75_to_100_RERSlope,PeakVCO2,75_to_100_VESlope,PredictedMaxHR,75_to_100_VEVCO2Slope,VEvsVCO2Slope,MeanRER,MeanVCO2,15_to_85_VESlope,StdHeartRate,LowestVE/VCO2,PeakVO2Real,15_to_85_VEVCO2Slope,VO2atVT,75_to_100_RRSlope,MinO2Pulse,PeakRER,MeanVE/VCO2,PeakRR,MeanVE,15_to_85_VCO2Slope,15_to_85_O2Slope,MeanO2Pulse,StdO2Pulse,15_to_85_HRSlope,MeanVO2,MaxVO2_EST,75_to_100_O2Slope,75_to_100_VCO2Slope,15_to_85_RERSlope,MeanRR,DiffPeakHR,75_to_100_VEVO2Slope,MaxO2Pulse,VO2vsPeakVO2atVT,15_to_85_VEVO2Slope,15_to_85_VO2Slope,PeakHeartRate,HasAnaerobicThreshold,LowestVCO2,LowestVO2,PeakVO2,LowestRR,LowestVE,LowestRER,DiffPeakRER,PeakVE/VCO2,MinHeartRate
75_to_100_VO2Slope,DiffPeakVO2,75_to_100_HRSlope,PeakVE,15_to_85_RRSlope,StdVE/VCO2,MeanHeartRate,75_to_100_RERSlope,HRvsVO2Slope,PredictedMaxHR,75_to_100_VEVCO2Slope,PeakHeartRate,VO2atVT,MeanVE,15_to_85_VO2Slope,MeanRER,StdHeartRate,75_to_100_VESlope,MeanVCO2,VEvsVCO2Slope,PeakVCO2,PeakRER,15_to_85_HRSlope,LowestVE/VCO2,15_to_85_VESlope,75_to_100_RRSlope,MinO2Pulse,15_to_85_VCO2Slope,MeanVE/VCO2,MeanVO2,MeanRR,PeakVO2Real,15_to_85_O2Slope,75_to_100_O2Slope,75_to_100_VEVO2Slope,MaxVO2_EST,MeanO2Pulse,DiffPeakHR,15_to_85_VEVCO2Slope,75_to_100_VCO2Slope,StdO2Pulse,15_to_85_RERSlope,PeakRR,15_to_85_VEVO2Slope,MaxO2Pulse,VO2vsPeakVO2atVT,HasAnaerobicThreshold,LowestVCO2,LowestVO2,PeakVO2,LowestRR,LowestVE,LowestRER,DiffPeakRER,PeakVE/VCO2,MinHeartRate
75_to_100_VO2Slope,DiffPeakVO2,PeakVE,75_to_100_HRSlope,PeakVO2Real,MeanHeartRate,15_to_85_RRSlope,StdVE/VCO2,75_to_100_VEVCO2Slope,MeanRER,75_to_100_RERSlope,75_to_100_VESlope,PredictedMaxHR,HRvsVO2Slope,15_to_85_VESlope,StdHeartRate,MeanVCO2,75_to_100_RRSlope,VO2atVT,MinO2Pulse,PeakVCO2,MeanVE,LowestVE/VCO2,15_to_85_HRSlope,VEvsVCO2Slope,15_to_85_VEVCO2Slope,15_to_85_VO2Slope,PeakRR,15_to_85_VCO2Slope,MeanVE/VCO2,75_to_100_O2Slope,75_to_100_VEVO2Slope,PeakHeartRate,75_to_100_VCO2Slope,MeanRR,15_to_85_VEVO2Slope,MeanO2Pulse,VO2vsPeakVO2atVT,PeakRER,DiffPeakHR,MaxVO2_EST,15_to_85_O2Slope,MaxO2Pulse,15_to_85_RERSlope,MeanVO2,StdO2Pulse,HasAnaerobicThreshold,LowestVCO2,LowestVO2,PeakVO2,LowestRR,LowestVE,LowestRER,DiffPeakRER,PeakVE/VCO2,MinHeartRate
75_to_100_VO2Slope,DiffPeakVO2,75_to_100_HRSlope,StdVE/VCO2,15_to_85_RRSlope,MeanHeartRate,HRvsVO2Slope,PeakVE,MeanRER,MeanVE,PeakHeartRate,75_to_100_RERSlope,75_to_100_VEVCO2Slope,MeanVCO2,PredictedMaxHR,StdHeartRate,PeakVCO2,VEvsVCO2Slope,VO2atVT,75_to_100_RRSlope,75_to_100_VESlope,75_to_100_VCO2Slope,15_to_85_VCO2Slope,MeanO2Pulse,PeakRER,15_to_85_HRSlope,LowestVE/VCO2,PeakVO2Real,15_to_85_VESlope,MeanVE/VCO2,75_to_100_O2Slope,DiffPeakHR,75_to_100_VEVO2Slope,15_to_85_RERSlope,15_to_85_VEVO2Slope,PeakRR,MinO2Pulse,15_to_85_VEVCO2Slope,StdO2Pulse,15_to_85_O2Slope,MaxO2Pulse,MaxVO2_EST,MeanRR,15_to_85_VO2Slope,VO2vsPeakVO2atVT,MeanVO2,HasAnaerobicThreshold,LowestVCO2,LowestVO2,PeakVO2,LowestRR,LowestVE,LowestRER,DiffPeakRER,PeakVE/VCO2,MinHeartRate
75_to_100_VO2Slope,DiffPeakVO2,75_to_100_VCO2Slope,PeakVE,StdVE/VCO2,PeakHeartRate,PeakVO2Real,75_to_100_HRSlope,MeanHeartRate,15_to_85_RRSlope,VO2atVT,PeakVCO2,HRvsVO2Slope,MeanVO2,PredictedMaxHR,MeanRER,75_to_100_VEVCO2Slope,LowestVE/VCO2,MeanVE,15_to_85_VEVCO2Slope,MeanVE/VCO2,75_to_100_VESlope,15_to_85_O2Slope,75_to_100_RERSlope,VEvsVCO2Slope,75_to_100_RRSlope,PeakRR,PeakRER,75_to_100_O2Slope,15_to_85_VO2Slope,MeanO2Pulse,StdHeartRate,StdO2Pulse,MinO2Pulse,75_to_100_VEVO2Slope,15_to_85_VCO2Slope,15_to_85_HRSlope,MeanRR,15_to_85_VESlope,DiffPeakHR,MeanVCO2,15_to_85_VEVO2Slope,MaxVO2_EST,VO2vsPeakVO2atVT,15_to_85_RERSlope,MaxO2Pulse,HasAnaerobicThreshold,LowestVCO2,LowestVO2,PeakVO2,LowestRR,LowestVE,LowestRER,DiffPeakRER,PeakVE/VCO2,MinHeartRate
DiffPeakVO2,75_to_100_VO2Slope,75_to_100_HRSlope,StdVE/VCO2,15_to_85_RRSlope,75_to_100_RERSlope,HRvsVO2Slope,PeakVE,MeanHeartRate,75_to_100_VEVCO2Slope,PredictedMaxHR,15_to_85_VESlope,75_to_100_VESlope,15_to_85_VEVCO2Slope,MeanVE,StdHeartRate,15_to_85_O2Slope,MeanVCO2,PeakVCO2,MeanRER,MeanO2Pulse,75_to_100_VCO2Slope,15_to_85_VO2Slope,MeanVO2,MeanVE/VCO2,PeakRER,MeanRR,VEvsVCO2Slope,VO2atVT,MinO2Pulse,75_to_100_VEVO2Slope,15_to_85_VCO2Slope,DiffPeakHR,75_to_100_RRSlope,75_to_100_O2Slope,PeakRR,15_to_85_VEVO2Slope,15_to_85_HRSlope,PeakHeartRate,VO2vsPeakVO2atVT,StdO2Pulse,LowestVE/VCO2,MaxO2Pulse,15_to_85_RERSlope,MaxVO2_EST,PeakVO2Real,HasAnaerobicThreshold,LowestVCO2,LowestVO2,PeakVO2,LowestRR,LowestVE,LowestRER,DiffPeakRER,PeakVE/VCO2,MinHeartRate
DiffPeakVO2,75_to_100_VO2Slope,75_to_100_HRSlope,StdVE/VCO2,75_to_100_RERSlope,15_to_85_RRSlope,HRvsVO2Slope,PeakVE,75_to_100_VEVCO2Slope,75_to_100_VESlope,PredictedMaxHR,MeanVE,MeanRER,PeakRER,LowestVE/VCO2,PeakHeartRate,MeanHeartRate,15_to_85_VESlope,15_to_85_O2Slope,15_to_85_HRSlope,MeanVCO2,VEvsVCO2Slope,MeanO2Pulse,VO2atVT,PeakRR,75_to_100_VEVO2Slope,15_to_85_VO2Slope,StdHeartRate,75_to_100_VCO2Slope,MeanVE/VCO2,15_to_85_RERSlope,PeakVCO2,MeanRR,15_to_85_VEVCO2Slope,75_to_100_RRSlope,15_to_85_VEVO2Slope,75_to_100_O2Slope,15_to_85_VCO2Slope,StdO2Pulse,MinO2Pulse,MeanVO2,PeakVO2Real,MaxVO2_EST,DiffPeakHR,MaxO2Pulse,VO2vsPeakVO2atVT,LowestVCO2,LowestVO2,PeakVO2,LowestRR,LowestVE,LowestRER,DiffPeakRER,PeakVE/VCO2,MinHeartRate,HasAnaerobicThreshold
75_to_100_VESlope,DiffPeakVO2,75_to_100_VO2Slope,75_to_100_HRSlope,PeakVO2Real,VO2atVT,PeakHeartRate,MeanVO2,75_to_100_VCO2Slope,PeakVE,StdVE/VCO2,DiffPeakHR,MeanHeartRate,75_to_100_RRSlope,MeanVE,VEvsVCO2Slope,75_to_100_RERSlope,15_to_85_VCO2Slope,PeakVCO2,StdHeartRate,PredictedMaxHR,MeanO2Pulse,15_to_85_RRSlope,MeanVCO2,PeakRER,LowestVE/VCO2,MeanRER,75_to_100_VEVO2Slope,VO2vsPeakVO2atVT,15_to_85_VEVO2Slope,15_to_85_O2Slope,HRvsVO2Slope,MeanVE/VCO2,MaxVO2_EST,15_to_85_VEVCO2Slope,15_to_85_HRSlope,15_to_85_VO2Slope,75_to_100_O2Slope,MinO2Pulse,75_to_100_VEVCO2Slope,15_to_85_VESlope,MeanRR,MaxO2Pulse,15_to_85_RERSlope,PeakRR,StdO2Pulse,HasAnaerobicThreshold,LowestVCO2,LowestVO2,PeakVO2,LowestRR,LowestVE,LowestRER,DiffPeakRER,PeakVE/VCO2,MinHeartRate
75_to_100_VO2Slope,DiffPeakVO2,StdVE/VCO2,MeanVE,75_to_100_VCO2Slope,15_to_85_RRSlope,DiffPeakHR,PeakRER,VO2atVT,75_to_100_RRSlope,75_to_100_HRSlope,75_to_100_VEVCO2Slope,MeanVE/VCO2,PeakVO2Real,LowestVE/VCO2,MeanRER,PeakVE,MeanHeartRate,75_to_100_VESlope,MeanVCO2,75_to_100_O2Slope,15_to_85_VEVCO2Slope,PeakVCO2,15_to_85_RERSlope,75_to_100_RERSlope,StdHeartRate,MeanVO2,15_to_85_VESlope,PeakRR,VEvsVCO2Slope,MinO2Pulse,75_to_100_VEVO2Slope,15_to_85_VEVO2Slope,PeakHeartRate,15_to_85_HRSlope,PredictedMaxHR,MaxVO2_EST,MeanO2Pulse,15_to_85_O2Slope,15_to_85_VO2Slope,HRvsVO2Slope,VO2vsPeakVO2atVT,MeanRR,MaxO2Pulse,StdO2Pulse,15_to_85_VCO2Slope,HasAnaerobicThreshold,LowestVCO2,LowestVO2,PeakVO2,LowestRR,LowestVE,LowestRER,DiffPeakRER,PeakVE/VCO2,MinHeartRate
DiffPeakVO2,75_to_100_VO2Slope,75_to_100_VCO2Slope,StdVE/VCO2,75_to_100_HRSlope,VEvsVCO2Slope,MeanHeartRate,MeanVCO2,PeakVCO2,MaxVO2_EST,15_to_85_VO2Slope,75_to_100_RRSlope,PeakRER,PredictedMaxHR,75_to_100_VESlope,HRvsVO2Slope,MeanRER,75_to_100_O2Slope,MinO2Pulse,PeakHeartRate,StdHeartRate,15_to_85_HRSlope,75_to_100_RERSlope,LowestVE/VCO2,MeanVE/VCO2,75_to_100_VEVCO2Slope,PeakVO2Real,15_to_85_VEVO2Slope,PeakRR,MeanVO2,15_to_85_O2Slope,15_to_85_VESlope,15_to_85_VEVCO2Slope,75_to_100_VEVO2Slope,PeakVE,MeanVE,MeanO2Pulse,15_to_85_VCO2Slope,15_to_85_RRSlope,DiffPeakHR,MeanRR,VO2vsPeakVO2atVT,MaxO2Pulse,15_to_85_RERSlope,StdO2Pulse,VO2atVT,HasAnaerobicThreshold,LowestVCO2,LowestVO2,PeakVO2,LowestRR,LowestVE,LowestRER,DiffPeakRER,PeakVE/VCO2,MinHeartRate
75_to_100_VO2Slope,DiffPeakVO2,PeakVO2Real,LowestVE/VCO2,75_to_100_HRSlope,PeakVCO2,PeakVE,15_to_85_VO2Slope,75_to_100_VCO2Slope,MeanRER,StdVE/VCO2,15_to_85_VEVCO2Slope,DiffPeakHR,75_to_100_VESlope,15_to_85_RRSlope,MeanHeartRate,PredictedMaxHR,MinO2Pulse,PeakRR,75_to_100_RERSlope,15_to_85_VCO2Slope,MeanVO2,MeanVE/VCO2,75_to_100_O2Slope,VO2atVT,15_to_85_HRSlope,HRvsVO2Slope,StdO2Pulse,75_to_100_RRSlope,MeanVE,15_to_85_VESlope,VEvsVCO2Slope,MeanRR,PeakRER,MeanVCO2,StdHeartRate,75_to_100_VEVCO2Slope,MeanO2Pulse,15_to_85_O2Slope,PeakHeartRate,MaxVO2_EST,15_to_85_VEVO2Slope,VO2vsPeakVO2atVT,15_to_85_RERSlope,MaxO2Pulse,75_to_100_VEVO2Slope,HasAnaerobicThreshold,LowestVCO2,LowestVO2,PeakVO2,LowestRR,LowestVE,LowestRER,DiffPeakRER,PeakVE/VCO2,MinHeartRate
DiffPeakVO2,75_to_100_VO2Slope,75_to_100_HRSlope,15_to_85_RRSlope,StdVE/VCO2,MeanRER,75_to_100_VEVCO2Slope,MeanHeartRate,MeanVE,PredictedMaxHR,PeakVE,75_to_100_RERSlope,HRvsVO2Slope,PeakVCO2,75_to_100_RRSlope,MeanVCO2,15_to_85_VESlope,DiffPeakHR,PeakRER,15_to_85_HRSlope,PeakRR,MeanVE/VCO2,LowestVE/VCO2,VEvsVCO2Slope,StdHeartRate,StdO2Pulse,15_to_85_O2Slope,MeanRR,15_to_85_RERSlope,15_to_85_VO2Slope,MeanO2Pulse,MaxVO2_EST,VO2atVT,15_to_85_VCO2Slope,75_to_100_VCO2Slope,15_to_85_VEVO2Slope,75_to_100_O2Slope,MaxO2Pulse,15_to_85_VEVCO2Slope,MeanVO2,MinO2Pulse,75_to_100_VEVO2Slope,PeakHeartRate,VO2vsPeakVO2atVT,75_to_100_VESlope,PeakVO2Real,HasAnaerobicThreshold,LowestVCO2,LowestVO2,PeakVO2,LowestRR,LowestVE,LowestRER,DiffPeakRER,PeakVE/VCO2,MinHeartRate
75_to_100_VO2Slope,DiffPeakVO2,75_to_100_HRSlope,VEvsVCO2Slope,75_to_100_VESlope,15_to_85_RRSlope,LowestVE/VCO2,PeakRR,MeanRER,PeakVE,VO2atVT,MeanHeartRate,MeanVE/VCO2,MeanVCO2,15_to_85_VEVCO2Slope,StdVE/VCO2,DiffPeakHR,15_to_85_RERSlope,15_to_85_O2Slope,15_to_85_VEVO2Slope,HRvsVO2Slope,75_to_100_VEVCO2Slope,PeakRER,MaxO2Pulse,15_to_85_VESlope,75_to_100_VCO2Slope,PredictedMaxHR,MinO2Pulse,75_to_100_RRSlope,15_to_85_HRSlope,MeanVO2,MeanO2Pulse,75_to_100_RERSlope,75_to_100_VEVO2Slope,PeakVO2Real,StdHeartRate,StdO2Pulse,MeanVE,PeakVCO2,MaxVO2_EST,15_to_85_VCO2Slope,MeanRR,75_to_100_O2Slope,PeakHeartRate,15_to_85_VO2Slope,VO2vsPeakVO2atVT,HasAnaerobicThreshold,LowestVCO2,LowestVO2,PeakVO2,LowestRR,LowestVE,LowestRER,DiffPeakRER,PeakVE/VCO2,MinHeartRate
75_to_100_VO2Slope,DiffPeakVO2,75_to_100_HRSlope,StdVE/VCO2,75_to_100_VCO2Slope,15_to_85_VO2Slope,15_to_85_VCO2Slope,75_to_100_RERSlope,15_to_85_VESlope,MeanO2Pulse,LowestVE/VCO2,MeanRER,VO2atVT,MeanHeartRate,MeanVCO2,MeanVO2,PeakVE,PeakVCO2,75_to_100_VEVO2Slope,MeanVE/VCO2,MeanRR,15_to_85_RRSlope,MeanVE,PeakVO2Real,VEvsVCO2Slope,StdO2Pulse,PredictedMaxHR,PeakRER,MinO2Pulse,MaxO2Pulse,15_to_85_VEVCO2Slope,DiffPeakHR,75_to_100_VESlope,PeakRR,75_to_100_VEVCO2Slope,HRvsVO2Slope,75_to_100_O2Slope,StdHeartRate,15_to_85_VEVO2Slope,15_to_85_RERSlope,PeakHeartRate,75_to_100_RRSlope,MaxVO2_EST,15_to_85_HRSlope,VO2vsPeakVO2atVT,15_to_85_O2Slope,HasAnaerobicThreshold,LowestVCO2,LowestVO2,PeakVO2,LowestRR,LowestVE,LowestRER,DiffPeakRER,PeakVE/VCO2,MinHeartRate
75_to_100_VCO2Slope,DiffPeakVO2,75_to_100_VO2Slope,PeakVO2Real,VO2atVT,DiffPeakHR,15_to_85_RRSlope,75_to_100_RRSlope,15_to_85_VO2Slope,LowestVE/VCO2,PeakRR,MinO2Pulse,MeanHeartRate,StdVE/VCO2,75_to_100_O2Slope,75_to_100_HRSlope,75_to_100_RERSlope,PeakVE,15_to_85_HRSlope,MeanO2Pulse,MaxVO2_EST,MeanVO2,MeanRER,PredictedMaxHR,MeanVCO2,PeakVCO2,StdO2Pulse,HRvsVO2Slope,15_to_85_O2Slope,75_to_100_VEVCO2Slope,MeanVE,15_to_85_VESlope,15_to_85_VEVCO2Slope,15_to_85_VEVO2Slope,VO2vsPeakVO2atVT,StdHeartRate,VEvsVCO2Slope,15_to_85_RERSlope,75_to_100_VESlope,75_to_100_VEVO2Slope,PeakRER,MeanVE/VCO2,MaxO2Pulse,MeanRR,PeakHeartRate,15_to_85_VCO2Slope,HasAnaerobicThreshold,LowestVCO2,LowestVO2,PeakVO2,LowestRR,LowestVE,LowestRER,DiffPeakRER,PeakVE/VCO2,MinHeartRate
