,SessionId,PatientId,sex,age,BMI,MaxVO2_EST,CardiacLim,PeakHeartRate,DiffPeakVO2,HRvsVO2Slope
0,7.0,7.0,F,40,35.91538066865196,2.3203851313499997,1,142.0,0.5860385031609128,41.90339119713104
1,8.0,8.0,M,69,35.05715686079555,2.6581898420799996,1,158.0,1.125138947342756,62.7856960197928
2,9.0,9.0,F,16,19.135217929144407,1.4450295500000003,0,201.0,-1.777328080729675,37.93643720726886
3,10.0,10.0,M,17,19.358400125176527,2.29437175,0,196.0,-2.0396092871398928,27.429500836447655
4,11.0,11.0,F,15,20.58250683575458,1.9341300000000003,0,192.0,-1.1998248826217648,33.810640693050814
5,12.0,12.0,M,15,22.954811746908376,2.6353040149999996,0,200.0,-1.9396378585504155,25.4034228892341
6,13.0,13.0,F,40,22.83200795926379,1.790210368,0,181.0,-0.6187961481387123,45.756136795180204
7,14.0,14.0,M,78,33.028599217014545,2.48987848416,0,180.0,0.060190745741421026,50.90885797181669
8,15.0,15.0,F,65,31.976006180906023,1.6459046640000001,0,138.0,0.8384520051877952,-40.21625072834419
10,17.0,17.0,M,19,25.264614591729185,3.74414710712,0,192.0,-3.195822432522334,18.503399829498807
11,18.0,18.0,M,21,21.895341040016596,3.47151719,0,218.0,-1.9937700185571288,22.803572433920806
12,19.0,19.0,M,48,29.055853959458783,2.7071030799999996,0,193.0,-0.3358209665164189,43.01763606749112
13,20.0,20.0,M,77,31.57332001315376,2.02758384728,0,143.0,0.2351117231802684,43.56811047997438
14,21.0,21.0,F,70,26.582856267899125,1.2386215493730002,0,176.0,-0.1946149899908609,73.94962184893873
16,23.0,23.0,F,52,28.6139398179527,1.722834145,0,175.0,-0.20421878996449783,52.667776665794506
17,24.0,24.0,F,59,33.36312861235584,1.8439477857000004,0,171.0,0.0166891392118107,46.31909036664173
18,25.0,25.0,M,68,26.631674131528275,2.063469304,0,187.0,-0.32628403767480485,35.63127398261849
19,26.0,26.0,M,53,24.878149339714664,2.796662241,0,176.0,0.005663424509826598,35.02588310265712
20,27.0,27.0,F,60,28.742331067032467,1.5254037000000003,0,172.0,-0.14277819620971655,62.036255404927694
21,28.0,28.0,M,70,27.23630892936397,2.311559584,0,137.0,0.2779089473270262,28.329315473664412
22,29.0,29.0,F,58,27.195373515626898,1.7153054070000002,0,167.0,-0.5630041766639402,36.189967952854545
23,30.0,30.0,M,62,29.677814457669726,2.6451516980000003,0,153.0,-0.6336254244975583,27.09912649981324
24,31.0,31.0,F,53,25.595429933983084,1.653234185,0,190.0,-0.24704187987274162,60.54040325053501
25,32.0,32.0,M,64,37.84013029063656,2.869207288,0,172.0,-0.22597465398608385,29.703500503724037
26,33.0,33.0,F,65,29.963194692014387,1.6018034820000002,0,153.0,-0.06099325376354958,51.98184573234273
27,34.0,34.0,M,50,28.212193937224686,2.9060445499999994,0,162.0,0.31701619154052674,23.192054672661826
28,35.0,35.0,M,55,28.86000614294424,2.6462794540000005,0,183.0,-0.2562805416512446,42.88031266465433
29,36.0,36.0,F,56,27.171312377519154,1.6881134280000003,0,182.0,-0.12874319469592255,58.391918956915795
30,37.0,37.0,M,63,33.4877680856149,3.1140162550000006,0,169.0,-0.6143296159716791,25.015427923734254
31,38.0,38.0,F,49,25.97994991908351,1.9311637549999998,0,192.0,0.039462116301421934,51.49175372251553
32,39.0,39.0,F,51,33.96377760497457,1.980542105,0,193.0,0.01685301617858892,52.923968423733555
33,40.0,40.0,M,45,31.544300343113676,3.2039882899999994,0,187.0,0.1296024085760492,27.047930025538168
34,41.0,41.0,M,66,26.216101814919682,2.164433408,0,162.0,-0.41609795071887223,35.38884604863311
35,42.0,42.0,F,66,40.391960186721185,2.1180705300000002,1,136.0,0.9789038633333333,47.37213741602893
36,43.0,43.0,M,79,27.56973140495868,2.10815024,1,115.0,0.6143407161904761,38.987082865602595
37,44.0,44.0,M,60,37.516976007243095,3.7385111400000004,1,140.0,2.2361581988235297,48.566750191919155
38,45.0,45.0,M,57,36.69753086419753,3.352254710000001,1,126.0,1.5690968152631586,27.49989473979042
39,46.0,46.0,M,80,39.02569414280463,2.8832780799999997,1,92.0,1.8726114133333331,34.98335114848235
40,47.0,47.0,F,54,41.29947123858355,2.2792626300000003,1,139.0,0.6416435823809525,34.73931979759511
41,48.0,48.0,M,73,21.0164054930001,1.84434751,1,163.0,0.4707760814285713,73.91226398824969
42,49.0,49.0,M,85,30.195312499999993,1.9081968799999998,1,97.0,0.7523145270588234,36.85371197527163
43,50.0,50.0,M,70,32.805922485121215,2.23157824,1,104.0,1.22407824,79.2817321419308
44,51.0,51.0,M,56,31.674964081659926,2.67278172,1,140.0,1.1869483866666666,44.770583900291896
45,52.0,52.0,M,83,36.31928898392863,2.68332472,1,83.0,1.8646580533333332,-15.447640377137068
46,53.0,53.0,M,77,32.491349480968864,2.31797784,1,148.0,0.3429778400000003,53.49419689442514
47,54.0,54.0,F,68,52.647233789411075,2.86455384,1,103.0,1.6801093955555557,43.038709180023794
48,55.0,55.0,F,56,37.61253462603878,1.9211243700000005,1,154.0,0.6001243700000001,69.44129469973666
49,56.0,56.0,M,76,33.210219468270196,2.68579328,1,97.0,1.03079328,27.43842689652295
50,57.0,57.0,F,57,32.34856679286101,2.11566861,0,167.0,0.2696686100000003,62.51964800962254
51,58.0,58.0,M,54,31.574905482041586,3.0139279100000005,0,180.0,-0.21207208999999994,38.076846267089984
52,59.0,59.0,F,61,28.796329259127404,1.6094114400000001,0,171.0,-0.0595359284210526,67.8573642829543
53,60.0,60.0,F,53,36.16064624295076,2.23143115,0,151.0,0.67583115,46.147537105553695
54,61.0,61.0,F,52,46.29629629629629,2.8568902499999997,0,153.0,0.924112472222222,45.386526450502345
55,62.0,62.0,F,58,38.48498704465782,2.2328373000000004,0,171.0,0.16617063333333348,54.97755722691784
56,63.0,63.0,F,57,34.68113083497699,1.8658561200000003,0,142.0,-0.21414387999999973,42.20193753393798
57,64.0,64.0,F,50,39.37557392102847,2.5206472,0,157.0,0.23445672380952365,33.43463058694746
58,65.1,65.0,F,67,39.48080043266631,2.36285232,0,139.0,0.45563009777777785,45.77252505309416
59,65.2,65.0,F,67,39.48080043266631,2.36285232,0,128.0,-65.93714768,1.0240454203797085
60,66.0,66.0,F,60,32.07031249999999,1.81500933,0,154.0,-0.34819067000000015,57.26642051820828
61,67.0,67.0,F,67,32.34856679286101,1.9360014300000004,0,132.0,0.2500014300000004,53.47361298757149
62,68.0,68.0,F,69,41.225141529975325,2.29811664,0,158.0,0.8092277511111112,53.122548561634275
63,69.0,69.0,F,51,39.06574394463669,2.65467415,0,149.0,0.7657852611111111,46.682596003654346
64,70.0,70.0,F,45,30.902301478433156,1.90694485,0,179.0,0.3700217730769233,98.66884760042238
65,71.0,71.0,F,52,31.528851873884598,1.9939448,0,163.0,0.034471115789473705,54.18684766965771
66,72.0,72.0,M,55,24.151672503320853,2.574328000000001,0,176.0,0.04432800000000103,47.4062640343799
67,73.0,73.0,M,31,24.453568409612362,3.0718034999999997,0,175.0,-1.8781965000000005,24.583126107743254
68,74.0,74.0,F,45,22.4058769513315,1.6133890000000004,0,160.0,-0.09661099999999956,57.93187705115909
69,75.0,75.0,M,37,27.18163008641324,2.2643923000000004,0,188.0,0.034392300000000375,54.08913437354805
70,76.0,76.0,M,59,30.367346938775512,2.6220327000000005,0,195.0,-0.7779672999999994,37.82769612674245
71,77.1,77.0,M,37,20.446742023841672,1.9334347,0,173.0,0.06343469999999996,64.92156351524349
72,77.2,77.0,M,37,20.446742023841672,1.9334347,0,183.0,-0.13656529999999978,53.24022384990028
73,78.1,78.0,M,23,22.145328719723185,2.427104,0,189.0,-0.1428959999999999,45.526480863044085
74,78.2,78.0,M,23,22.145328719723185,2.427104,0,156.0,0.037103999999999804,38.06854803904724
75,79.0,79.0,M,27,29.40759637188209,2.9790027999999995,0,178.0,0.4290027999999997,46.13131751436774
76,80.1,80.0,M,65,24.78425751739377,2.4337177000000003,0,175.0,-0.25628229999999963,43.58483533053913
77,81.0,81.0,F,75,25.674519165803343,1.1531043,0,116.0,0.23310430000000004,67.55378269568008
78,82.0,82.0,M,66,27.70083102493075,1.9995336,0,156.0,-0.5004664000000001,39.01333584953136
79,83.0,83.0,M,76,24.337479718766904,2.1111768,0,145.0,-0.008823200000000142,31.076991146357532
80,84.0,84.0,M,41,26.989619377162633,2.6361582000000006,1,150.0,0.8861582000000006,54.04386140881713
81,85.0,85.0,M,64,28.373702422145332,2.0242191999999997,1,131.0,1.1142191999999995,52.27331490284213
82,86.0,86.0,F,57,20.93962585034014,1.4369692200000004,1,134.0,0.6069692200000004,90.69512438581802
83,87.0,87.0,M,71,30.693877551020407,2.3204464,1,83.0,1.2904463999999998,18.68223519599667
84,88.0,88.0,M,58,27.39817568244846,2.3118998000000004,1,146.0,0.8618998000000004,55.0735305884047
85,89.0,89.0,M,61,22.59814049586777,2.2525370000000007,1,180.0,0.35253700000000077,65.39129369768432
86,90.0,90.0,M,47,20.897959183673468,2.2121664,1,181.0,0.3321664000000002,52.865346420800876
87,91.0,91.0,M,57,32.83061454806607,2.7066144000000003,0,148.0,0.5066144000000001,33.09369421211257
88,92.0,92.0,M,60,29.75274443418488,2.4528693000000006,1,118.0,0.8228693000000007,42.41467185736169
89,93.0,93.0,M,72,24.8109640831758,2.4630396,1,154.0,0.5130396000000002,43.70310450144933
90,94.0,94.0,M,65,30.449826989619382,2.1723328,1,135.0,1.1023328,46.468931538564696
91,95.0,95.0,M,46,27.005130974885226,2.1861699999999997,1,149.0,1.0161699999999998,55.13925589793456
92,96.0,96.0,F,60,21.6712580348944,1.4345378000000002,1,114.0,0.36453780000000013,53.24900746082585
93,97.0,97.0,F,60,21.6712580348944,1.4345378000000002,1,156.0,0.21453780000000022,71.80412830980588
94,98.0,98.0,F,70,32.049981743681286,1.5981621000000001,1,185.0,0.7781621000000002,128.1371259124697
95,99.0,99.0,M,77,25.854639471416256,1.9995336,1,94.0,0.6995335999999999,34.5267386912104
96,100.0,100.0,M,32,23.589835468362743,2.9959565,1,166.0,0.0759565000000002,43.68174910050281
97,101.0,101.0,F,43,21.874999999999996,1.5743056000000002,1,186.0,0.7843056000000002,148.2851640963495
98,102.0,102.0,M,21,25.082863029651524,3.0148943999999998,1,148.0,0.8348943999999996,36.03776478553447
99,103.0,103.0,F,22,24.444444444444443,1.6117750000000002,1,141.0,0.6517750000000002,91.56794646955348
100,104.0,104.0,M,25,19.377162629757787,2.123716,1,166.0,0.443716,62.36169597886217
101,105.0,105.0,F,37,17.78197125852809,1.3775174000000001,1,157.0,0.7775174000000001,189.01681928049177
102,106.0,106.0,M,42,31.020408163265305,3.2107055000000004,0,100.0,2.2107055000000004,42.04630990358079
103,107.0,107.0,M,29,26.54320987654321,3.0866776,1,178.0,1.3966775999999999,75.01489055931967
104,108.0,108.0,M,26,24.074074074074073,2.958033,1,192.0,0.1580330000000001,43.56702129206782
105,109.0,109.0,F,61,28.228978666296452,1.3485453000000003,0,87.0,0.7285453000000003,55.28098077526601
106,110.0,110.0,F,51,36.808447352766215,2.3278365,1,134.0,1.4178365,79.12653481361664
107,111.0,111.0,M,50,26.27728507868255,2.7483279999999994,1,133.0,1.0883279999999995,38.53523558704285
108,112.0,112.0,M,58,26.874496103198062,2.5374510000000003,1,150.0,1.1874510000000003,53.93796238886726
109,113.0,113.0,F,47,28.906249999999993,1.739999,1,136.0,0.8499990000000001,91.68085453739768
110,114.0,114.0,M,38,24.898143956541425,3.2102312000000004,1,128.0,2.1402312000000006,54.385818561001074
111,115.0,115.0,M,54,22.145328719723185,2.0594624000000006,0,132.0,1.0994624000000006,80.86583720581623
112,116.0,116.0,F,40,21.938775510204085,1.2088418,0,133.0,0.5888418000000001,103.45744876288732
113,117.0,117.0,M,29,19.835162956123252,2.199563,0,149.0,1.399563,97.99535413548948
114,118.0,118.0,F,67,24.341758286340216,1.302492,1,157.0,0.2224919999999999,75.04314475691568
115,119.0,119.0,M,26,17.91663167324543,2.427104,0,162.0,0.23710399999999998,43.77308300983085
116,120.0,120.0,M,54,29.065926806711587,2.4810632000000004,0,169.0,-0.17893679999999978,37.19680049421605
117,121.0,121.0,M,50,23.384353741496604,2.2812966,0,126.0,0.8912966000000002,49.554907493439124
118,122.0,122.0,M,65,34.256055363321806,2.4438744,0,129.0,1.5438744,50.01696352841392
119,123.0,123.0,M,61,21.04981790236894,2.0272833000000006,0,149.0,0.7772833000000006,71.62776188281812
120,124.0,124.0,M,62,26.061679307694877,2.1991242000000004,0,140.0,1.2391242000000005,27.38936502541904
121,125.0,125.0,M,50,24.56747404844291,2.4541221,0,144.0,1.4441221000000002,81.24458988077434
122,126.0,126.0,M,50,30.056810675122207,2.8420209999999995,0,147.0,1.6420209999999995,23.537579576458363
123,127.0,127.0,M,64,25.88057063502083,2.0242191999999997,0,161.0,0.6042191999999997,51.4699169513488
124,128.0,128.0,M,55,25.640242971826257,2.3682876000000004,0,154.0,0.3382876000000006,39.37489755012944
125,129.0,129.0,F,67,18.06616733787497,1.0419936,0,108.0,0.5819936000000001,57.77083194786193
126,130.0,130.0,F,45,22.07409972299169,1.3488990000000003,0,174.0,0.4688990000000003,135.1559524779153
127,131.0,131.0,M,20,18.749999999999996,1.820328,0,182.0,1.080328,215.42450407259744
128,132.0,132.0,F,39,25.910684346898332,1.6624979999999998,0,173.0,0.5424979999999997,78.53570283716903
129,133.0,133.0,F,37,20.19557823129252,1.6024182,0,149.0,0.2524181999999999,61.862464431201936
130,134.0,134.0,M,47,28.075042938300964,2.6546349999999994,0,150.0,1.4246349999999994,80.82384573373103
131,135.0,135.0,M,53,35.56649909373825,3.2480239999999996,0,168.0,0.7980239999999994,32.69458922257211
132,136.0,136.0,M,51,24.933720489837143,2.7306429000000003,0,170.0,0.19064290000000028,45.43741465533813
133,137.0,137.0,M,62,31.239414355075468,2.3400937,0,99.0,1.7100937000000003,65.83300895289997
134,138.0,138.0,F,60,22.8625344752504,1.5317946000000002,0,140.0,0.6217946000000002,66.23617515034394
135,139.0,139.0,M,53,26.25072494734593,2.6858659999999994,0,150.0,1.0458659999999995,56.24413397888852
136,140.0,140.0,M,37,20.936639118457304,2.0793543000000003,0,156.0,1.2993543000000003,150.43767261152465
137,141.0,141.0,F,52,20.199469763918696,1.6927360000000005,0,108.0,1.0727360000000004,65.91756005274323
138,142.0,142.0,M,69,35.56394251705618,2.4191887999999997,0,128.0,0.9091887999999997,37.47212850655488
