issue,keyword
foreign_policy_issue,immigration
foreign_policy_issue,immigrant
foreign_policy_issue,national security
foreign_policy_issue,taxpayer fund
foreign_policy_issue,military
foreign_policy_issue,border
foreign_policy_issue,terrorism
foreign_policy_issue,nuclear
foreign_policy_issue,chinese
foreign_policy_issue,china
foreign_policy_issue,russia
foreign_policy_issue,korea
foreign_policy_issue,iran
foreign_policy_issue,iraq
foreign_policy_issue,security
foreign_policy_issue,warfare
foreign_policy_issue,defense
law_order_issue,law enforcement
law_order_issue,trafficking
law_order_issue,brave men
law_order_issue,trafficking
law_order_issue,sexual assault
law_order_issue,opioid
law_order_issue,fbi investigation
law_order_issue,marijuana
law_order_issue,corruption
law_order_issue,crime
economic_issue,small business
economic_issue,renewable energy
economic_issue,tax credits
economic_issue,environment
economic_issue,renewable energy
economic_issue,economy
economic_issue,agricultur
economic_issue,trade wars
economic_issue,jobs
economic_issue,tariffs
economic_issue,crude oil
economic_issue,clean energy
economic_issue,tax cuts
economic_issue,energy jobs
economic_issue,trade deals
economic_issue,farming
economic_issue,energy
economic_issue,payment protection
social_issue,brett kavanaugh
social_issue,lgbtq
social_issue,gun violence
social_issue,tuition
social_issue,woman's right
social_issue,woman right
social_issue,abortion
social_issue,racial
social_issue,assault weapons
social_issue,violence against women act
social_issue,black man
social_issue,black people
social_issue,black americans
social_issue,black lives matter
social_issue,civil rights
social_issue,equal marriage
social_issue,domestic violence
social_welfare_issue,healthcare
social_welfare_issue,health care
social_welfare_issue,obama care
social_welfare_issue,obamacare
social_welfare_issue,medicare
social_welfare_issue,social security
social_welfare_issue,drug costs
social_welfare_issue,veteran
social_welfare_issue,drug enforcement act
social_welfare_issue,opioid
social_welfare_issue,mental health
covid,covid
covid,coronavirus
covid,pandemic
