"ntisid","Status_VF","Time_VF","Status_Tol","Time_Tol","Time_VFT","Status_VFT"
219142,0,160,0,1176,1176,0
774883,0,128,0,898,898,0
1115225,0,160,0,1124,1124,0
1436392,0,176,0,1234,1234,0
1949886,0,96,2,714,714,4
2137207,0,176,2,1272,1272,4
2298256,0,128,0,883,883,0
2579821,0,128,0,935,935,0
2826985,0,112,0,792,792,0
2858121,0,8,2,161,161,4
3144080,1,144,0,1357,1062,2
3245678,1,160,0,1116,1116,2
3960840,0,48,1,12,12,1
4113389,0,128,0,908,908,0
4723789,0,144,0,999,999,0
4731613,0,160,0,1099,1099,0
4919536,1,128,2,827,827,4
6363591,0,128,0,892,892,0
6606746,0,176,1,75,75,1
6641549,0,36,2,328,328,4
6722254,0,128,0,902,902,0
7524750,0,176,0,1197,1197,0
8116091,0,128,0,894,894,0
8148220,0,192,0,1307,1307,0
9461256,0,192,0,1353,1353,0
9673683,0,176,0,1230,1230,0
10075477,0,160,0,1148,1148,0
10486098,1,112,2,1252,805,2
10523224,0,192,0,1352,1352,0
11083310,0,192,0,1458,1458,0
11464367,0,160,1,599,599,1
11792168,0,128,0,891,891,0
12217870,0,80,2,577,577,4
12811248,1,24,2,377,177,2
13116210,0,160,1,84,84,1
14736467,1,24,1,1050,172,2
15350452,0,192,0,1316,1316,0
15413967,0,192,1,65,65,1
15843348,0,144,0,1006,1006,0
16707202,0,160,0,1092,1092,0
18764326,1,16,2,14,14,4
19863305,1,64,0,700,454,2
21587593,0,64,2,392,392,4
21829284,1,128,0,877,877,2
22170864,0,144,0,1014,1014,0
23036359,0,160,0,1146,1146,0
23136352,0,80,2,566,566,4
23702648,0,176,0,1245,1245,0
24923131,0,144,0,1009,1009,0
24954230,0,160,0,1078,1078,0
25100375,0,48,2,335,335,4
25173856,0,160,1,98,98,1
26229419,0,192,0,1344,1344,0
26279603,0,176,0,1232,1232,0
27384063,0,160,0,1127,1127,0
27936036,0,192,0,1440,1440,0
28480107,1,24,0,1061,172,2
29838616,0,176,0,1254,1254,0
30135441,0,192,0,1435,1435,0
30590001,0,112,0,781,781,0
32239775,1,16,0,918,97,2
32259481,0,128,0,920,920,0
32687902,0,176,0,1225,1225,0
32723653,0,192,0,1373,1373,0
32734901,0,128,0,870,870,0
32995661,1,16,2,347,153,2
33196118,0,160,1,909,909,1
33488755,0,112,0,786,786,0
33727341,0,192,0,1348,1348,0
33887312,0,176,0,1231,1231,0
34085325,0,160,0,1120,1120,0
34524392,0,176,0,1246,1246,0
36214628,0,112,0,839,839,0
36952525,0,144,0,1020,1020,0
37182919,1,24,0,1232,167,2
37739050,0,144,0,1022,1022,0
38345901,0,128,0,897,897,0
38367991,0,128,2,1236,1236,4
38586096,1,96,2,979,679,2
39257888,0,160,0,1130,1130,0
39921409,0,128,0,902,902,0
39925219,0,160,0,1125,1125,0
41264090,1,144,0,1033,1033,2
41959004,0,192,0,1341,1341,0
42192313,1,96,0,705,671,2
42454607,0,112,2,813,813,4
43259080,0,80,2,547,547,4
44569565,0,112,1,549,549,1
44610351,0,128,0,888,888,0
44812503,1,24,0,896,162,2
44927097,1,128,0,957,896,2
46054011,1,96,0,1385,700,2
46064709,0,192,0,1344,1344,0
46301905,0,144,0,1009,1009,0
46603187,0,128,0,896,896,0
47179342,0,160,0,1149,1149,0
47359186,0,128,0,897,897,0
48217606,0,160,0,1109,1109,0
48334774,1,128,0,928,928,2
49554094,0,128,0,1136,1136,0
50502612,0,192,0,1344,1344,0
50693491,0,128,0,881,881,0
50715955,1,48,2,791,350,2
51142291,1,48,2,559,331,2
51170642,0,144,0,1008,1008,0
51801830,0,112,2,805,805,4
52523621,0,96,2,685,685,4
52562750,0,144,0,961,961,0
52732250,0,192,0,1352,1352,0
54028679,1,128,0,882,882,2
54071352,0,144,0,994,994,0
54224783,0,112,2,755,755,4
54809202,1,128,0,886,886,2
55706121,0,144,1,809,809,1
57224816,0,144,0,990,990,0
57366576,0,192,0,1380,1380,0
57459622,1,112,0,821,821,2
57629656,0,36,2,252,252,4
58199972,0,160,0,1100,1100,0
58466002,0,160,0,1199,1199,0
58997894,1,176,0,1284,1256,2
60129483,0,176,0,1232,1232,0
60576426,0,80,2,564,564,4
61894779,0,160,0,1099,1099,0
62500868,0,192,0,1350,1350,0
63107556,0,160,0,1089,1089,0
63511182,0,160,0,1094,1094,0
64301356,0,176,0,1232,1232,0
64465634,0,192,0,1440,1440,0
64757257,0,96,2,721,721,4
64922650,0,144,0,986,986,0
65010780,0,176,0,1254,1254,0
65876353,0,160,0,1129,1129,0
65893311,0,128,0,928,928,0
66001549,0,160,0,1164,1164,0
66112016,0,160,0,1141,1141,0
66388600,0,160,0,1113,1113,0
69950622,0,176,0,1246,1246,0
69977405,0,160,0,1122,1122,0
70095272,1,16,0,1250,110,2
70773232,0,192,0,1451,1451,0
70904540,0,176,0,1213,1213,0
71650257,1,36,1,198,198,1
71808375,0,192,2,1244,1244,4
72440696,0,192,0,1444,1444,0
72486055,1,16,2,857,125,2
73558502,0,128,2,352,352,4
74799004,0,176,0,1232,1232,0
75680911,1,96,2,1103,689,2
75853455,0,112,0,753,753,0
75876778,0,192,0,1451,1451,0
76022100,0,176,0,1239,1239,0
76846232,0,144,0,1057,1057,0
76872558,0,192,1,119,119,1
77146814,1,24,0,1110,161,2
77586478,0,144,0,963,963,0
78254018,0,144,0,1008,1008,0
78340079,0,128,0,926,926,0
79600810,0,128,2,948,948,4
80754253,0,144,0,1009,1009,0
80973987,0,112,0,778,778,0
81403089,0,176,0,1239,1239,0
81438423,0,8,2,56,56,4
82281243,0,128,0,901,901,0
82619474,0,144,0,998,998,0
83348256,0,144,0,1016,1016,0
83378679,0,128,0,950,950,0
83973718,0,160,0,1096,1096,0
84863142,0,128,0,863,863,0
85606267,0,160,1,973,973,1
86129853,0,160,0,1106,1106,0
86239179,0,176,0,1218,1218,0
86696568,0,176,0,1205,1205,0
87161833,0,160,0,1121,1121,0
87678171,0,112,0,776,776,0
88728669,0,128,2,895,895,4
88781113,0,48,2,465,465,4
88818215,0,144,0,1045,1045,0
89448441,1,128,1,426,426,1
89503191,0,192,0,1310,1310,0
89657391,0,144,1,27,27,1
90498116,0,192,0,1334,1334,0
90879450,0,192,0,1399,1399,0
91291230,0,160,0,1071,1071,0
91319270,0,192,0,1455,1455,0
91750130,0,144,1,595,595,1
92276693,0,160,0,1288,1288,0
92883105,0,160,0,1120,1120,0
93533242,1,24,1,250,180,2
94160927,1,176,0,1233,1233,2
94805975,0,160,0,1134,1134,0
95168118,0,160,0,1124,1124,0
95829169,0,4,2,28,28,4
96786141,0,144,0,1002,1002,0
97223154,0,176,0,1233,1233,0
97561926,0,128,1,28,28,1
97650731,0,192,0,1295,1295,0
97857111,0,144,0,1014,1014,0
98082999,0,192,0,1428,1428,0
98677647,0,48,2,472,472,4
