%SEQUENCE	NC_001133	1	edf5563344e9d461f41327d5c667e356
%SEQUENCE	NC_001134	2	d8567f8f783057eb0731f8edd0d32f74
%SEQUENCE	NC_001135	3	604e89e58881845f8f25de905fe485b3
%SEQUENCE	NC_001136	4	3c2c09c81940a0cfe40f69b4959862d2
%SEQUENCE	NC_001137	5	2b9aeb682e653932db18aa15141a894f
%SEQUENCE	NC_001138	6	fd3779b3bbe087e37069db421a1247c0
%SEQUENCE	NC_001139	7	1a353ce6aba3f3532a95048d8f06ad64
%SEQUENCE	NC_001140	8	2f9ae3f9e9190c744498cf76bf270ff7
%SEQUENCE	NC_001141	9	2fd34473d35a98406b22cf1acc7e4272
%SEQUENCE	NC_001142	10	9ba2b893970288a9155c3f50585ee794
%SEQUENCE	NC_001143	11	363e20bd3b012be3d274e16da565fb99
%SEQUENCE	NC_001144	12	067e857685b396768fae540c4c7a2390
%SEQUENCE	NC_001145	13	f054292ca762f4437c4d5d2d1fc24afe
%SEQUENCE	NC_001146	14	1263a38ecfd09590ffb83acb714d5542
%SEQUENCE	NC_001147	15	1f4eb562e9f05e3edc9e1ce9e3c08683
%SEQUENCE	NC_001148	16	62dc661cfae03971c41c29fe9ff4e08e
%SEQUENCE	NC_001224	17	71c39cf065b8d574f636b654c274cf1b


# Name	Chromosome	StartCoord	StopCoord	Alias(es)	Corresponding	Description

YEL077C	5	4098	4697			
YEL075W-A	5	4270	4869			
YEL076C-A	5	5115	5714			
YEL076C	5	5115	5714			
YEL075C	5	5714	6313			
YEL074W	5	5526	6125			
YEL073C	5	7554	8153			
RMD6	5	13120	13719			
DLD3	5	15755	16354			
YEL070W	5	18989	19588			
HXT13	5	23232	23831			
YEL068C	5	25979	26578			
HPA3	5	26067	26666			
YEL067C	5	26777	27376			
SIT1	5	27057	27656			
YEL064C	5	31240	31839			
CAN1	5	33467	34066			
NPR2	5	33780	34379			
CIN8	5	39652	40251			
PRB1	5	41954	42553			
SOM1	5	42625	43224			
YEL059W	5	42052	42651			
PCM1	5	42652	43251			
YEL057C	5	45722	46321			
HAT2	5	46568	47167			
POL5	5	51540	52139			
RPL12A	5	53219	53818			
MAK10	5	56103	56702			
AFG1	5	55971	56570			
VMA8	5	57778	58377			
RML2	5	60852	61451			
PAU2	5	63128	63727			
YEL048C	5	65168	65767			
YEL047C	5	66798	67397			
GLY1	5	68793	69392			
YEL045C	5	69266	69865			
IES6	5	69157	69756			
YEL043W	5	69878	70477			
GDA1	5	73171	73770			
YEL041W	5	75344	75943			
UTR2	5	77453	78052			
CYC7	5	79978	80577			
UTR4	5	79820	80419			
RAD23	5	82604	83203			
ANP1	5	84553	85152			
UTR5	5	85546	86145			
HYP2	5	85076	85675			
YEL033W	5	85579	86178			
MCM3	5	86337	86936			
SPF1	5	89658	90257			
ECM10	5	94044	94643			
BUD16	5	97797	98396			
YEL028W	5	98068	98667			
CUP5	5	100169	100768			
SNU13	5	101343	101942			
SRI1	5	106148	106747			
YEL024W	5	106660	107259			
YEL023C	5	110553	111152			
GEA2	5	110821	111420			
URA3	5	115567	116166			
TIM9	5	116611	117210			
YEL020C	5	120300	120899			
MMS21	5	121302	121901			
EAF5	5	120871	121470			
PMP2	5	122930	123529			
YEL017W	5	123057	123656			
YEL016C	5	126219	126818			
YEL015W	5	126029	126628			
YEL014C	5	128609	129208			
VAC8	5	128225	128824			
UBC8	5	131172	131771			
GLC3	5	132520	133119			
YEL010W	5	135679	136278			
GCN4	5	139764	140363			
YEL008W	5	139912	140511			
YEL007W	5	141291	141890			
YEL006W	5	143726	144325			
VAB2	5	146755	147354			
YEA4	5	146350	146949			
GIM4	5	147627	148226			
WBP1	5	150014	150613			
YEL001C	5	150978	151577			
MNN1	5	152919	153518			
NOP16	5	156202	156801			
PMI40	5	159118	159717			
YER004W	5	158979	159578			
YND1	5	159949	160548			
NUG1	5	162122	162721			
PAC2	5	163926	164525			
YER007C-A	5	166885	167484			
SEC3	5	171818	172417			
NTF2	5	171514	172113			
YER010C	5	173338	173937			
TIR1	5	174647	175246			
PRE1	5	177234	177833			
PRP22	5	178240	178839			
HEM14	5	181999	182598			
FAA2	5	183940	184539			
BUD25	5	184700	185299			
BIM1	5	187676	188275			
AFG3	5	191788	192387			
SPC25	5	192624	193223			
ISC1	5	192196	192795			
SBH2	5	194539	195138			
GPA2	5	194567	195166			
RPN3	5	196347	196946			
SRB4	5	198211	198810			
PRO3	5	200475	201074			
YAT2	5	201591	202190			
GCD11	5	204650	205249			
CHO1	5	208474	209073			
GAL83	5	210232	210831			
YER028C	5	211876	212475			
SMB1	5	213177	213776			
YER030W	5	212815	213414			
YPT31	5	214747	215346			
FIR1	5	214315	214914			
ZRG8	5	221287	221886			
YER034W	5	221245	221844			
EDC2	5	222038	222637			
KRE30	5	225199	225798			
PHM8	5	225288	225887			
KRE29	5	228252	228851			
HVG1	5	229205	229804			
YER039C-A	5	229481	230080			
GLN3	5	229194	229793			
YEN1	5	231860	232459			
MXR1	5	234336	234935			
SAH1	5	237119	237718			
ERG28	5	238016	238615			
MEI4	5	239774	240373			
ACA1	5	241501	242100			
SPO73	5	242579	243178			
SAP1	5	246503	247102			
CAJ1	5	248157	248756			
YER048W-A	5	250117	250716			
YER049W	5	251127	251726			
RSM18	5	254579	255178			
YER051W	5	254055	254654			
HOM3	5	257958	258557			
YER053C	5	259639	260238			
YER053C-A	5	261046	261645			
GIP2	5	263698	264297			
HIS1	5	265785	266384			
FCY2	5	268113	268712			
RPL34A	5	270184	270783			
HMF1	5	271125	271724			
PET117	5	271166	271765			
PCL6	5	272022	272621			
FCY21	5	273965	274564			
FCY22	5	275970	276569			
CEM1	5	279625	280224			
HOR2	5	280681	281280			
THO1	5	281108	281707			
YER064C	5	284221	284820			
ICL1	5	286913	287512			
YER066W	5	289640	290239			
YER067W	5	291464	292063			
YER066C-A	5	292202	292801			
MOT2	5	292448	293047			
ARG5,6	5	294808	295407			
RNR1	5	298348	298947			
YER071C	5	302326	302925			
VTC1	5	302204	302803			
ALD5	5	303427	304026			
RPS24A	5	305719	306318			
YER074W-A	5	307049	307648			
PTP3	5	311196	311795			
YER076C	5	313495	314094			
YER077C	5	316597	317196			
YER078C	5	318339	318938			
YER079W	5	318316	318915			
YER080W	5	319359	319958			
SER3	5	322082	322681			
UTP7	5	325933	326532			
YER084W	5	326461	327060			
RMD7	5	327094	327693			
YER085C	5	328137	328736			
ILV1	5	327873	328472			
YER087W	5	329972	330571			
SBH1	5	332827	333426			
DOT6	5	335185	335784			
PTC2	5	337337	337936			
TRP2	5	337345	337944			
MET6	5	342164	342763			
YER091C-A	5	342608	343207			
IES5	5	342251	342850			
TSC11	5	347609	348208			
YER093C-A	5	348397	348996			
PUP3	5	349343	349942			
RAD51	5	349376	349975			
SHC1	5	351094	351693			
YER097W	5	354536	355135			
UBP9	5	354862	355461			
PRS2	5	359058	359657			
UBC6	5	358958	359557			
AST2	5	361791	362390			
RPS8B	5	362496	363095			
SSA4	5	363985	364584			
RTT105	5	366198	366797			
NUP157	5	372010	372609			
MAM1	5	371722	372321			
GLE2	5	374542	375141			
FLO8	5	377611	378210			
KAP123	5	382100	382699			
SWI4	5	385873	386472			
LSM4	5	386628	387227			
YER113C	5	390049	390648			
BOI2	5	393709	394308			
SPR6	5	394864	395463			
SLX8	5	396169	396768			
RPL23B	5	396165	396764			
SHO1	5	399052	399651			
YER119C	5	400839	401438			
SCS2	5	400531	401130			
YER119C-A	5	401235	401834			
YER121W	5	401771	402370			
GLO3	5	404349	404948			
YCK3	5	404209	404808			
DSE1	5	409060	409659			
RSP5	5	409585	410184			
NSA2	5	414176	414775			
LCP5	5	413877	414476			
YER128W	5	415255	415854			
PAK1	5	416677	417276			
YER130C	5	422443	423042			
RPS26B	5	423348	423947			
PMD1	5	430446	431045			
GLC7	5	431891	432490			
YER134C	5	437800	438399			
YER135C	5	438341	438940			
GDI1	5	439012	439611			
YER137C	5	441816	442415			
YER138W-A	5	448870	449469			
YER139C	5	451239	451838			
YER140W	5	450960	451559			
COX15	5	452854	453453			
MAG1	5	456032	456631			
DDI1	5	455714	456313			
UBP5	5	460219	460818			
FTR1	5	461736	462335			
LSM5	5	461980	462579			
SCC4	5	464838	465437			
SPT15	5	464698	465297			
PEA2	5	467466	468065			
SPI1	5	467765	468364			
UBP3	5	472420	473019			
YER152C	5	473984	474583			
PET122	5	474801	475400			
OXA1	5	474415	475014			
BEM2	5	482844	483443			
YER156C	5	484337	484936			
COG3	5	484183	484782			
YER158C	5	490574	491173			
BUR6	5	491954	492553			
SPT2	5	500344	500943			
RAD4	5	502890	503489			
YER163C	5	503778	504377			
CHD1	5	504787	505386			
PAB1	5	509768	510367			
DNF1	5	512139	512738			
BCK2	5	517611	518210			
CCA1	5	522665	523264			
RPH1	5	522764	523363			
ADK2	5	525369	525968			
RAD3	5	526477	527076			
BRR2	5	536017	536616			
RAD24	5	535695	536294			
GRX4	5	539164	539763			
TMT1	5	540359	540958			
ECM32	5	541085	541684			
BMH1	5	545006	545605			
PDA1	5	546143	546742			
DMC1	5	547816	548415			
ISC10	5	550523	551122			
YER181C	5	551792	552391			
YER182W	5	551920	552519			
FAU1	5	553965	554564			
YER184C	5	558676	559275			
YER185W	5	558849	559448			
YER186C	5	562621	563220			
KHS1	5	565067	565666			
YER187W	5	565625	566224			
YER188W	5	567435	568034			
YER189W	5	570550	571149			
YRF1-2	5	570875	571474			
YFL068W	6	1	52			
YFL067W	6	236	835			
YFL066C	6	2616	3215			
YFL065C	6	3339	3938			
YFL064C	6	3847	4446			
YFL063W	6	4466	5065			
COS4	6	5826	6425			
YFL061W	6	8945	9544			
SNO3	6	10970	11569			
SNZ3	6	10763	11362			
THI5	6	12329	12928			
YFL057C	6	14764	15363			
AAD6	6	15432	16031			
AGP3	6	16404	17003			
YFL054C	6	22788	23387			
DAK2	6	22823	23422			
YFL052W	6	27632	28231			
YFL051C	6	30541	31140			
ALR2	6	35849	36448			
YFL049W	6	36203	36802			
EMP47	6	40181	40780			
RGD2	6	39821	40420			
YFL046W	6	42215	42814			
SEC53	6	44393	44992			
YFL044C	6	45561	46160			
YFL042C	6	47745	48344			
FET5	6	48539	49138			
YFL040W	6	50750	51349			
ACT1	6	54696	55295			
YPT1	6	55986	56585			
TUB2	6	55735	56334			
RPO41	6	58181	58780			
MOB2	6	63993	64592			
RPL22B	6	64932	65531			
YFL034W	6	64875	65474			
RIM15	6	74426	75025			
YFL032W	6	74270	74869			
HAC1	6	74577	75176			
YFL030W	6	76229	76828			
CAK1	6	79160	79759			
CAF16	6	80212	80811			
GYP8	6	81911	82510			
STE2	6	81978	82577			
YFL025C	6	87233	87832			
EPL1	6	90344	90943			
BUD27	6	90384	90983			
FRS2	6	95009	95608			
GAT1	6	95364	95963			
PAU5	6	99594	100193			
YFL019C	6	100600	101199			
LPD1	6	103122	103721			
SMX2	6	103093	103692			
GNA1	6	104457	105056			
MDJ1	6	106231	106830			
YFL015C	6	106958	107557			
HSP12	6	106650	107249			
YFL012W-A	6	109204	109803			
IES1	6	109925	110524			
YFL012W	6	110041	110640			
HXT10	6	111739	112338			
AUA1	6	114384	114983			
WWM1	6	115738	116337			
CDC4	6	115539	116138			
SMC1	6	118824	119423			
BLM3	6	122874	123473			
YFL006W	6	128540	129139			
SEC4	6	129728	130327			
VTC2	6	131204	131803			
MSH4	6	137152	137751			
SPB4	6	146929	147528			
DEG1	6	146525	147124			
LOC1	6	148504	149103			
NIC96	6	149410	150009			
YFR003C	6	153119	153718			
RPN11	6	152787	153386			
SAD1	6	155868	156467			
YFR006W	6	155538	156137			
YFR007W	6	158692	159291			
YFR008W	6	159928	160527			
GCN20	6	161881	162480			
UBP6	6	164459	165058			
YFR011C	6	167251	167850			
YFR012W	6	167280	167879			
YFR012W-A	6	168615	169214			
IOC3	6	169313	169912			
CMK1	6	173869	174468			
GSY1	6	176383	176982			
YFR016C	6	180735	181334			
YFR017C	6	182849	183448			
YFR018C	6	184210	184809			
FAB1	6	183889	184488			
YFR020W	6	192125	192724			
AUT10	6	194199	194798			
YFR022W	6	196220	196819			
PES4	6	199261	199860			
YFR024C	6	203069	203668			
LSB3	6	203421	204020			
HIS2	6	204738	205337			
YFR026C	6	206245	206844			
ECO1	6	206839	207438			
CDC14	6	210056	210655			
PTR3	6	210324	210923			
MET10	6	212699	213298			
SMC2	6	220094	220693			
RPL2A	6	221406	222005			
YFR032C	6	222947	223546			
RPL29	6	223425	224024			
QCR6	6	224757	225356			
PHO4	6	225946	226545			
YFR035C	6	226453	227052			
CDC26	6	226349	226948			
RSC8	6	229173	229772			
YFR038W	6	228766	229365			
YFR039C	6	233532	234131			
SAP155	6	233921	234520			
YFR041C	6	238244	238843			
YFR042W	6	237846	238445			
YFR043C	6	239816	240415			
YFR044C	6	241426	242025			
YFR045W	6	241850	242449			
YFR046C	6	244147	244746			
BNA6	6	245154	245753			
RMD8	6	245533	246132			
YMR31	6	247910	248509			
PRE4	6	249854	250453			
RET2	6	251792	252391			
RPN12	6	251893	252492			
HXK1	6	255038	255637			
YFR054C	6	259422	260021			
YFR055W	6	263592	264191			
YFR056C	6	264314	264913			
YFR057W	6	268449	269048			
COS12	7	2190	2789			
YGL262W	7	4712	5311			
YGL261C	7	6653	7252			
YGL260W	7	6260	6859			
YPS5	7	7870	8469			
YGL258W-A	7	8562	9161			
VEL1	7	10510	11109			
MNT2	7	14158	14757			
ADH4	7	14310	14909			
ZRT1	7	20378	20977			
FZF1	7	21704	22303			
HXK2	7	23335	23934			
RTG2	7	27485	28084			
HFM1	7	31637	32236			
YGL250W	7	31298	31897			
ZIP2	7	32498	33097			
PDE1	7	35053	35652			
BRR6	7	36333	36932			
RAI1	7	38781	39380			
YGL245W	7	38375	38974			
RTF1	7	40898	41497			
TAD1	7	42707	43306			
YGL242C	7	45198	45797			
KAP114	7	44845	45444			
DOC1	7	47914	48513			
CSE1	7	48952	49551			
YGL239C	7	49746	50345			
YGL237C	7	53529	54128			
YGL235W	7	54678	55277			
MTO1	7	55796	56395			
ADE5,7	7	55881	56480			
SEC15	7	58521	59120			
YGL232W	7	61474	62073			
YGL231C	7	63620	64219			
YGL230C	7	64215	64814			
SAP4	7	66959	67558			
SHE10	7	66997	67596			
VID30	7	69070	69669			
OST5	7	73157	73756			
YGL226W	7	72738	73337			
VRG4	7	76292	76891			
SDT1	7	78856	79455			
COG1	7	80364	80963			
EDC1	7	81185	81784			
NIF3	7	82291	82890			
YGL220W	7	81772	82371			
YGL218W	7	83048	83647			
MMM2	7	84256	84855			
KIP3	7	84283	84882			
YGL217C	7	85179	85778			
CLG1	7	87379	87978			
YGL214W	7	89410	90009			
SKI8	7	91251	91850			
VAM7	7	90835	91434			
YGL211W	7	91915	92514			
YPT32	7	93195	93794			
MIG2	7	95260	95859			
SIP2	7	96740	97339			
SPT16	7	98371	98970			
CHC1	7	107507	108106			
POX1	7	107560	108159			
YGL204C	7	112008	112607			
KEX1	7	114667	115266			
ARO8	7	115461	116060			
MCM6	7	120910	121509			
EMP24	7	123309	123908			
YGL198W	7	122994	123593			
YGL199C	7	124046	124645			
MDS3	7	124101	124700			
YGL196W	7	129953	130552			
GCN1	7	130929	131528			
HOS2	7	141731	142330			
YGL193C	7	142232	142831			
IME4	7	141650	142249			
COX13	7	144212	144811			
CDC55	7	147394	147993			
RPS26A	7	148593	149192			
YGL188C	7	149521	150120			
COX4	7	150176	150775			
YGL186C	7	152781	153380			
YGL185C	7	154311	154910			
STR3	7	156017	156616			
MND1	7	157072	157671			
YGL182C	7	157601	158200			
GTS1	7	157310	157909			
APG1	7	159469	160068			
YGL179C	7	165096	165695			
MPT5	7	166756	167355			
YGL177W	7	166963	167562			
YGL176C	7	173084	173683			
SAE2	7	174327	174926			
BUD13	7	173949	174548			
KEM1	7	180118	180717			
NUP49	7	180104	180703			
ROK1	7	181794	182393			
SPO74	7	185399	185998			
SUA5	7	185463	186062			
HUR1	7	186868	187467			
PMR1	7	190473	191072			
CUP2	7	190533	191132			
YGL165C	7	191981	192580			
YGL164C	7	193305	193904			
RAD54	7	196408	197007			
SUT1	7	197542	198141			
YGL161C	7	200147	200746			
YGL160W	7	199965	200564			
YGL159W	7	202125	202724			
RCK1	7	206436	207035			
YGL157W	7	208409	209008			
AMS1	7	209819	210418			
CDC43	7	213484	214083			
LYS5	7	216100	216699			
PEX14	7	215676	216275			
YGL152C	7	217373	217972			
NUT1	7	216927	217526			
YGL149W	7	224975	225574			
INO80	7	225577	226176			
ARO2	7	225802	226401			
RPL9A	7	228333	228932			
YGL146C	7	229690	230289			
TIP20	7	229646	230245			
YGL144C	7	234511	235110			
YGL143C	7	235962	236561			
GPI10	7	238123	238722			
HUL5	7	237756	238355			
YGL140C	7	245016	245615			
YGL139W	7	245119	245718			
YGL138C	7	249535	250134			
SEC27	7	249272	249871			
MRM2	7	253863	254462			
RPL1B	7	254044	254643			
PCL10	7	255066	255665			
ITC1	7	257110	257709			
YGL132W	7	260983	261582			
SNT2	7	265863	266462			
CEG1	7	265548	266147			
RSM23	7	269193	269792			
CWC23	7	270341	270940			
SOH1	7	270780	271379			
SCS3	7	270401	271000			
MET13	7	271924	272523			
MON1	7	276716	277315			
RPS2	7	277018	277617			
NAB2	7	280525	281124			
GPG1	7	281159	281758			
PRP43	7	283939	284538			
ABC1	7	283843	284442			
YGL118C	7	288453	289052			
YGL117W	7	287913	288512			
CDC20	7	289207	289806			
SNF4	7	291431	292030			
YGL114W	7	292858	293457			
SLD3	7	295330	295929			
TAF6	7	299727	300326			
NSA1	7	299376	299975			
CUE3	7	303410	304009			
YGL109W	7	302911	303510			
YGL108C	7	304070	304669			
RMD9	7	306272	306871			
MLC1	7	305958	306557			
ARC1	7	306835	307434			
VPS73	7	310172	310771			
RPL28	7	310365	310964			
YGL102C	7	311932	312531			
YGL101W	7	311591	312190			
SEH1	7	312632	313231			
LSG1	7	314029	314628			
USE1	7	316740	317339			
SRM1	7	321180	321779			
TOS8	7	324729	325328			
VPS45	7	330606	331205			
PAN2	7	334464	335063			
SPC105	7	334284	334883			
NUP145	7	337304	337903			
NBP35	7	343041	343640			
LIF1	7	342717	343316			
MF(ALPHA)2	7	345152	345751			
YGL088W	7	345234	345833			
MMS2	7	346903	347502			
MAD1	7	346517	347116			
YGL085W	7	349014	349613			
GUP1	7	352297	352896			
SCY1	7	352456	353055			
YGL082W	7	355225	355824			
YGL081W	7	356775	357374			
YGL080W	7	358034	358633			
YGL079W	7	358842	359441			
DBP3	7	361858	362457			
HNM1	7	363915	364514			
RPL7A	7	365995	366594			
MPS2	7	368087	368686			
HSF1	7	368151	368750			
YGL074C	7	368921	369520			
YGL072C	7	371361	371960			
RCS1	7	371410	372009			
RPB9	7	374826	375425			
YGL068W	7	374485	375084			
YGL069C	7	375513	376112			
NPY1	7	375499	376098			
SGF73	7	377007	377606			
ALG2	7	381270	381869			
MRH4	7	383207	383806			
PUS2	7	383052	383651			
PYC1	7	384594	385193			
DUO1	7	389710	390309			
YGL060W	7	389465	390064			
YGL059W	7	391623	392222			
RAD6	7	393386	393985			
YGL057C	7	395830	396429			
SDS23	7	397619	398218			
OLE1	7	398025	398624			
ERV14	7	401285	401884			
PRM8	7	401986	402585			
YGL052W	7	402834	403433			
YGL051W	7	403084	403683			
YGL050W	7	405173	405772			
TIF4632	7	409602	410201			
RPT6	7	411284	411883			
YGL047W	7	410949	411548			
YGL046W	7	413500	414099			
YGL045W	7	414436	415035			
RNA15	7	417032	417631			
DST1	7	416878	417477			
YGL042C	7	418589	419188			
YGL041C	7	419223	419822			
HEM2	7	420553	421152			
YGL039W	7	423358	423957			
OCH1	7	426802	427401			
PNC1	7	427945	428544			
YGL036W	7	427997	428596			
MIG1	7	433059	433658			
YGL034C	7	433576	434175			
HOP2	7	435021	435620			
AGA2	7	436830	437429			
RPL24A	7	437931	438530			
RPL30	7	438487	439086			
CGR1	7	439459	440058			
SCW11	7	442906	443505			
CWH41	7	446140	446739			
TRP5	7	448532	449131			
YGL024W	7	449184	449783			
PGD1	7	450056	450655			
PIB2	7	452101	452700			
STT3	7	451800	452399			
ALK1	7	454181	454780			
SWF3	7	457867	458466			
CKB1	7	457552	458151			
JAC1	7	459661	460260			
ATE1	7	459250	459849			
KAP122	7	461062	461661			
YGL015C	7	465432	466031			
PUF4	7	465537	466136			
PDR1	7	472295	472894			
ERG4	7	472251	472850			
SCL1	7	475244	475843			
YGL010W	7	474941	475540			
LEU1	7	478649	479248			
PMA1	7	482663	483262			
YGL007W	7	482656	483255			
PMC1	7	485316	485915			
COG7	7	490543	491142			
YGL004C	7	491952	492551			
YGL003C	7	494170	494769			
ERP6	7	493912	494511			
ERG26	7	496498	497097			
YGR001C	7	498030	498629			
GOD1	7	499902	500501			
YGR003W	7	499527	500126			
YGR004W	7	502333	502932			
TFG2	7	505855	506454			
PRP18	7	505465	506064			
MUQ1	7	506363	506962			
STF2	7	508359	508958			
SEC9	7	510997	511596			
NMA2	7	510939	511538			
YGR011W	7	511891	512490			
YGR012W	7	512553	513152			
SNU71	7	513948	514547			
MSB2	7	516337	516936			
YGR015C	7	522071	522670			
YGR016W	7	521655	522254			
YGR017W	7	523181	523780			
YGR018C	7	524689	525288			
UGA1	7	524623	525222			
VMA7	7	527324	527923			
YGR021W	7	527026	527625			
MTL1	7	528658	529257			
YGR022C	7	529581	530180			
YGR024C	7	532591	533190			
YGR025W	7	532033	532632			
YGR026W	7	532379	532978			
RPS25A	7	534453	535052			
MSP1	7	541597	542196			
ERV1	7	542947	543546			
POP6	7	546152	546751			
YGR031W	7	545835	546434			
GSC2	7	547658	548257			
YGR033C	7	554962	555561			
RPL26B	7	555323	555922			
YGR035C	7	557417	558016			
CAX4	7	558863	559462			
ACB1	7	559989	560588			
ORM1	7	560076	560675			
YGR039W	7	574282	574881			
KSS1	7	574792	575391			
BUD9	7	576881	577480			
YGR042W	7	578870	579469			
YGR043C	7	581431	582030			
RME1	7	583887	584486			
YGR045C	7	584291	584890			
YGR046W	7	584289	584888			
TFC4	7	589464	590063			
UFD1	7	589220	589819			
SCM4	7	590708	591307			
YGR050C	7	592437	593036			
YGR051C	7	593224	593823			
YGR052W	7	592990	593589			
YGR053C	7	595832	596431			
YGR054W	7	596087	596686			
MUP1	7	598811	599410			
RSC1	7	601055	601654			
LST7	7	605505	606104			
YGR058W	7	605530	606129			
SPR3	7	606957	607556			
ERG25	7	609958	610557			
ADE6	7	615960	616559			
COX18	7	617273	617872			
YGR064W	7	617015	617614			
SPT4	7	617819	618418			
VHT1	7	619853	620452			
YGR066C	7	621794	622393			
YGR067C	7	624781	625380			
YGR069W	7	626477	627076			
YGR068C	7	627079	627678			
ROM1	7	627200	627799			
YGR071C	7	634058	634657			
UPF3	7	633698	634297			
SMD1	7	635106	635705			
YGR073C	7	635981	636580			
PRP38	7	636870	637469			
MRPL25	7	637572	638171			
PEX8	7	639508	640107			
PAC10	7	640366	640965			
YGR079W	7	640114	640713			
TWF1	7	641404	642003			
YGR081C	7	643775	644374			
TOM20	7	643438	644037			
GCD2	7	646810	647409			
MRP13	7	648137	648736			
RPL11B	7	648902	649501			
YGR086C	7	650612	651211			
PDC6	7	652976	653575			
CTT1	7	653995	654594			
YGR089W	7	656354	656953			
UTP22	7	661752	662351			
PRP31	7	665735	666334			
DBF2	7	667583	668182			
YGR093W	7	669782	670381			
VAS1	7	671580	672179			
RRP46	7	676436	677035			
TPC1	7	676015	676614			
ASK10	7	678089	678688			
ESP1	7	687453	688052			
TEL2	7	687293	687892			
MDR1	7	689639	690238			
PCP1	7	692757	693356			
YGR102C	7	695130	695729			
NOP7	7	694811	695410			
SRB5	7	698363	698962			
VMA21	7	697993	698592			
YGR106C	7	699781	700380			
YGR107W	7	702061	702660			
CLB1	7	703030	703629			
CLB6	7	706496	707095			
YGR110W	7	713103	713702			
YGR111W	7	715222	715821			
SHY1	7	716752	717351			
DAM1	7	718287	718886			
SPT6	7	719803	720402			
YGR114C	7	720649	721248			
YGR115C	7	721146	721745			
YGR117C	7	726474	727073			
RPS23A	7	726368	726967			
NUP57	7	729667	730266			
COG2	7	730856	731455			
MEP1	7	732923	733522			
YGR122W	7	733330	733929			
YGR122C-A	7	735754	736353			
PPT1	7	738199	738798			
ASN2	7	739339	739938			
YGR125W	7	741720	742319			
YGR126W	7	745230	745829			
YGR127W	7	746193	746792			
UTP8	7	750087	750686			
SYF2	7	749795	750394			
YGR130C	7	753840	754439			
YGR131W	7	754121	754720			
PHB1	7	756448	757047			
PEX4	7	756291	756890			
CAF130	7	757165	757764			
PRE9	7	760787	761386			
LSB1	7	761823	762422			
YGR137W	7	762283	762882			
TPO2	7	765602	766201			
YGR139W	7	765121	765720			
CBF2	7	766824	767423			
VPS62	7	769964	770563			
BTN2	7	771849	772448			
SKN1	7	774588	775187			
THI4	7	779794	780393			
ENP2	7	781162	781761			
YGR146C	7	784854	785453			
NAT2	7	786916	787515			
RPL24B	7	787775	788374			
YGR149W	7	788426	789025			
YGR150C	7	793049	793648			
YGR151C	7	794986	795585			
RSR1	7	795488	796087			
YGR153W	7	795487	796086			
YGR154C	7	797864	798463			
CYS4	7	797938	798537			
PTI1	7	799941	800540			
CHO2	7	801835	802434			
MTR3	7	806017	806616			
FYV13	7	806468	807067			
NSR1	7	807652	808251			
YGR161C	7	809416	810015			
TIF4631	7	823454	824053			
GTR2	7	826947	827546			
YGR164W	7	828020	828619			
YGR165W	7	828511	829110			
KRE11	7	829910	830509			
CLC1	7	831851	832450			
YGR168C	7	834478	835077			
PUS6	7	835899	836498			
PSD2	7	836537	837136			
MSM1	7	842547	843146			
YIP1	7	843587	844186			
YGR173W	7	843249	843848			
CBP4	7	846401	847000			
ERG1	7	848419	849018			
YGR176W	7	848115	848714			
ATF2	7	850432	851031			
PBP1	7	853211	853810			
OKP1	7	854891	855490			
RNR4	7	856297	856896			
TIM13	7	857682	858281			
YGR182C	7	858900	859499			
QCR9	7	859472	860071			
UBR1	7	865749	866348			
TYS1	7	867516	868115			
TFG1	7	867169	867768			
HGH1	7	871412	872011			
BUB1	7	875105	875704			
CRH1	7	878188	878787			
HIP1	7	879815	880414			
YGR190C	7	880657	881256			
TDH3	7	883806	884405			
PDX1	7	885737	886336			
XKS1	7	887871	888470			
SKI6	7	888277	888876			
FYV8	7	892182	892781			
SNG1	7	894136	894735			
YGR198W	7	894088	894687			
PMT6	7	896897	897496			
ELP2	7	902266	902865			
YGR201C	7	903340	903939			
PCT1	7	904744	905343			
YGR203W	7	904632	905231			
ADE3	7	905329	905928			
YGR205W	7	908608	909207			
YGR206W	7	909827	910426			
YGR207C	7	911624	912223			
SER2	7	911278	911877			
TRX2	7	913223	913822			
YGR210C	7	914734	915333			
ZPR1	7	914636	915235			
YGR212W	7	916435	917034			
RTA1	7	919461	920060			
RPS0A	7	919970	920569			
RSM27	7	921570	922169			
GPI1	7	924458	925057			
CCH1	7	924089	924688			
CRM1	7	931934	932533			
YGR219W	7	935428	936027			
MRPL9	7	936877	937476			
TOS2	7	938986	939585			
PET54	7	939316	939915			
YGR223C	7	942209	942808			
AZR1	7	942199	942798			
AMA1	7	944538	945137			
YGR226C	7	946994	947593			
DIE2	7	946812	947411			
YGR228W	7	948757	949356			
SMI1	7	950892	951491			
BNS1	7	951286	951885			
PHB2	7	953474	954073			
NAS6	7	953353	953952			
PHO81	7	958204	958803			
YHB1	7	959298	959897			
YGR235C	7	962056	962655			
SPG1	7	962813	963412			
YGR237C	7	965652	966251			
KEL2	7	968684	969283			
PEX21	7	970050	970649			
PFK1	7	973731	974330			
YGR242W	7	975811	976410			
YAP1802	7	976578	977177			
YGR243W	7	976732	977331			
LSC2	7	979316	979915			
SDA1	7	982065	982664			
BRF1	7	984269	984868			
YGR247W	7	984362	984961			
SOL4	7	985368	985967			
MGA1	7	987445	988044			
YGR250C	7	993518	994117			
YGR251W	7	995035	995634			
GCN5	7	996265	996864			
PUP2	7	999137	999736			
ENO1	7	1000323	1000922			
COQ6	7	1003959	1004558			
GND2	7	1004021	1004620			
YGR257C	7	1007303	1007902			
RAD2	7	1010764	1011363			
TNA1	7	1011882	1012481			
YGR259C	7	1012919	1013518			
APL6	7	1016748	1017347			
BUD32	7	1017757	1018356			
YGR263C	7	1019239	1019838			
YGR265W	7	1021045	1021644			
MES1	7	1021851	1022450			
YGR266W	7	1022053	1022652			
FOL2	7	1025733	1026332			
YGR269W	7	1026033	1026632			
YGR268C	7	1026651	1027250			
YTA7	7	1026767	1027366			
SLH1	7	1031188	1031787			
YGR271C-A	7	1037989	1038588			
YGR272C	7	1038498	1039097			
YGR273C	7	1039236	1039835			
YGR274C	7	1043093	1043692			
RTT102	7	1042586	1043185			
RNH70	7	1045478	1046077			
YGR277C	7	1046559	1047158			
CWC22	7	1046128	1046727			
SCW4	7	1049956	1050555			
PXR1	7	1051723	1052322			
YOR1	7	1052221	1052820			
BGL2	7	1058722	1059321			
YGR283C	7	1060038	1060637			
ERV29	7	1061588	1062187			
ZUO1	7	1063151	1063750			
BIO2	7	1064938	1065537			
YGR287C	7	1068989	1069588			
MAL13	7	1069690	1070289			
YGR290W	7	1074879	1075478			
MAL11	7	1075811	1076410			
YGR291C	7	1076502	1077101			
MAL12	7	1075996	1076595			
YGR294W	7	1079703	1080302			
YGR293C	7	1080344	1080943			
COS6	7	1082727	1083326			
YRF1-3	7	1084261	1084860			
YHL050C	8	3311	3910			
YHL049C	8	4541	5140			
COS8	8	5800	6399			
ARN2	8	10212	10811			
YHL046C	8	12284	12883			
YHL045W	8	11900	12499			
YHL044W	8	12963	13562			
ECM34	8	14299	14898			
YHL042W	8	15065	15664			
YHL041W	8	16790	17389			
ARN1	8	20969	21568			
YHL039W	8	21180	21779			
CBP2	8	25507	26106			
YHL037C	8	26178	26777			
MUP3	8	25639	26238			
YHL035C	8	32755	33354			
SBP1	8	34076	34675			
RPL8A	8	36024	36623			
GUT1	8	38507	39106			
GOS1	8	39485	40084			
ECM29	8	39482	40081			
YHL029C	8	47967	48566			
WSC4	8	48161	48760			
RIM101	8	50509	51108			
YHL026C	8	54024	54623			
SNF6	8	54248	54847			
RIM4	8	56046	56645			
RMD11	8	62561	63160			
SPO11	8	64155	64754			
YHL021C	8	65856	66455			
OPI1	8	67453	68052			
APM2	8	69545	70144			
YHL018W	8	69104	69703			
YHL017W	8	69672	70271			
DUR3	8	74241	74840			
RPS20	8	74808	75407			
YLF2	8	77311	77910			
YHL013C	8	78350	78949			
YHL012W	8	78331	78930			
PRS3	8	81612	82211			
YHL010C	8	83717	84316			
YAP3	8	85056	85655			
YHL008C	8	94506	95105			
STE20	8	97933	98532			
SHU1	8	98790	99389			
MRP4	8	98613	99212			
YHL005C	8	99215	99814			
LAG1	8	101878	102477			
HSE1	8	102005	102604			
RPL14B	8	103670	104269			
OSH7	8	105448	106047			
QCR10	8	107219	107818			
LEU5	8	108205	108804			
YHR003C	8	111311	111910			
NEM1	8	113088	113687			
GPA1	8	114911	115510			
MRS11	8	115895	116494			
STP2	8	117207	117806			
ERG11	8	121677	122276			
SOD2	8	123584	124183			
YHR009C	8	125674	126273			
RPL27A	8	125913	126512			
DIA4	8	127172	127771			
VPS29	8	128873	129472			
ARD1	8	131439	132038			
SPO13	8	131438	132037			
MIP6	8	133945	134544			
YSC84	8	138447	139046			
YSC83	8	138085	138684			
ARG4	8	141394	141993			
DED81	8	143550	144149			
YHR020W	8	143387	143986			
RPS27B	8	148661	149260			
ECM12	8	148616	149215			
YHR022C	8	150337	150936			
MYO1	8	151057	151656			
MAS2	8	159184	159783			
THR1	8	158829	159428			
PPA1	8	160235	160834			
RPN1	8	164703	165302			
DAP2	8	167426	168025			
YHR029C	8	168553	169152			
SLT2	8	170336	170935			
RRM3	8	172962	173561			
YHR032W	8	172735	173334			
YHR033W	8	174939	175538			
YHR034C	8	177991	178590			
YHR035W	8	177610	178209			
YHR036W	8	179736	180335			
PUT2	8	181368	181967			
FIL1	8	183457	184056			
MSC7	8	186801	187400			
VMA10	8	187671	188270			
YHR040W	8	187315	187914			
SRB2	8	189856	190455			
NCP1	8	189934	190533			
DOG2	8	193537	194136			
DOG1	8	194800	195399			
YHR045W	8	194942	195541			
INM1	8	198277	198876			
AAP1'	8	201302	201901			
YHR048W	8	203998	204597			
FSH1	8	205853	206452			
YHR049C-A	8	207523	208122			
SMF2	8	207046	207645			
COX6	8	209097	209696			
CIC1	8	210240	210839			
CUP1-1	8	212721	213320			
YHR054C	8	214250	214849			
CUP1-2	8	214719	215318			
RSC30	8	217682	218281			
CPR2	8	218845	219444			
MED6	8	219886	220485			
FYV4	8	219509	220108			
VMA22	8	220126	220725			
GIC1	8	222480	223079			
RPP1	8	223760	224359			
PAN5	8	225171	225770			
SSZ1	8	227245	227844			
RRP3	8	229165	229764			
SSF1	8	228736	229335			
RMD12	8	230371	230970			
DYS1	8	231534	232133			
RRP4	8	234660	235259			
TRM5	8	234282	234881			
PCL5	8	236405	237004			
ERG7	8	238499	239098			
NOP10	8	241065	241664			
OSH3	8	241983	242582			
QNS1	8	245594	246193			
PPE1	8	249643	250242			
PTC7	8	250502	251101			
NMD2	8	255758	256357			
YHR078W	8	255761	256360			
IRE1	8	261593	262192			
SAE3	8	262555	263154			
YHR080C	8	266840	267439			
YHR081W	8	266939	267538			
KSP1	8	271550	272149			
YHR083W	8	272028	272627			
STE12	8	273575	274174			
YHR085W	8	276165	276764			
NAM8	8	277554	278153			
YHR087W	8	280221	280820			
RPF1	8	280896	281495			
GAR1	8	283300	283899			
YNG2	8	284627	285226			
MSR1	8	286772	287371			
HXT4	8	288814	289413			
AHT1	8	288544	289143			
HXT1	8	292628	293227			
YHR095W	8	292345	292944			
HXT5	8	296450	297049			
YHR097C	8	298612	299211			
SFB3	8	301937	302536			
TRA1	8	302163	302762			
YHR100C	8	314676	315275			
BIG1	8	315971	316570			
KIC1	8	315974	316573			
SBE22	8	319816	320415			
GRE3	8	322811	323410			
YHR105W	8	324168	324767			
TRR2	8	325000	325599			
CDC12	8	328039	328638			
GGA2	8	327705	328304			
CTM1	8	329712	330311			
ERP5	8	331684	332283			
UBA4	8	332474	333073			
YHR112C	8	335666	336265			
YHR113W	8	335739	336338			
BZZ1	8	337485	338084			
YHR115C	8	341362	341961			
YHR116W	8	341067	341666			
TOM71	8	341751	342350			
ORC6	8	345631	346230			
SET1	8	345445	346044			
MSH1	8	348976	349575			
YHR121W	8	352158	352757			
YHR122W	8	353027	353626			
EPT1	8	354217	354816			
NDT80	8	355963	356562			
YHR125W	8	358260	358859			
YHR126C	8	360184	360783			
YHR127W	8	360315	360914			
FUR1	8	361412	362011			
ARP1	8	364156	364755			
YHR130C	8	365303	365902			
YHR131C	8	367865	368464			
ECM14	8	369796	370395			
YHR132W-A	8	369455	370054			
YHR133C	8	371599	372198			
WSS1	8	371150	371749			
YCK1	8	374312	374911			
SPL2	8	375102	375701			
ARO9	8	375110	375709			
YHR138C	8	377701	378300			
SPS100	8	379201	379800			
YHR139C-A	8	380421	381020			
YHR140W	8	379973	380572			
RPL42B	8	382753	383352			
CHS7	8	382939	383538			
DSE2	8	384911	385510			
RPC10	8	386634	387233			
DCD1	8	388728	389327			
YHR145C	8	389339	389938			
CRP1	8	389701	390300			
MRPL6	8	393285	393884			
IMP3	8	392935	393534			
YHR149C	8	396661	397260			
YHR150W	8	396652	397251			
YHR151C	8	400850	401449			
SPO12	8	400835	401434			
SPO16	8	402684	403283			
RTT107	8	402367	402966			
YHR155W	8	406504	407103			
LIN1	8	412408	413007			
REC104	8	412308	412907			
KEL1	8	417181	417780			
YHR159W	8	416950	417549			
PEX18	8	420074	420673			
YAP1801	8	422288	422887			
YHR162W	8	422473	423072			
SOL3	8	423031	423630			
DNA2	8	429179	429778			
PRP8	8	436949	437548			
CDC23	8	439051	439650			
THP2	8	438742	439341			
YHR168W	8	439777	440376			
DBP8	8	441580	442179			
NMD3	8	443227	443826			
APG7	8	445111	445710			
SPC97	8	447733	448332			
YHR173C	8	451152	451751			
ENO2	8	450725	451324			
CTR2	8	452270	452869			
YHR176W	8	453627	454226			
YHR177W	8	455987	456586			
STB5	8	458695	459294			
OYE2	8	461898	462497			
YHR180W	8	464574	465173			
YHR181W	8	466624	467223			
YHR182W	8	467615	468214			
GND1	8	470356	470955			
SSP1	8	472140	472739			
PFS1	8	475337	475936			
KOG1	8	480669	481268			
IKI1	8	480386	480985			
GPI16	8	483834	484433			
YHR189W	8	483424	484023			
ERG9	8	484241	484840			
CTF8	8	486628	487227			
YHR192W	8	486222	486821			
EGD2	8	488233	488832			
YHR194W	8	488053	488652			
NVJ1	8	490143	490742			
UTP9	8	491327	491926			
YHR197W	8	493292	493891			
YHR198C	8	497277	497876			
YHR199C	8	498419	499018			
RPN10	8	498475	499074			
PPX1	8	501140	501739			
YHR202W	8	501784	502383			
RPS4B	8	505527	506126			
MNL1	8	505715	506314			
SCH9	8	508759	509358			
SKN7	8	512128	512727			
SET5	8	516482	517081			
YHR208W	8	516928	517527			
YHR209W	8	518833	519432			
YHR210C	8	521734	522333			
FLO5	8	524788	525387			
YHR212C	8	538091	538690			
YHR213W	8	538547	539146			
YHR214W	8	541047	541646			
YHR214W-A	8	542404	543003			
PHO12	8	551495	552094			
IMD2	8	553792	554391			
YHR217C	8	557039	557638			
YHR218W	8	557410	558009			
YHR219W	8	559569	560168			
YIL177C	9	6148	6747			
YIL176C	9	9156	9755			
YIL175W	9	8583	9182			
YIL174W	9	8869	9468			
VTH1	9	10892	11491			
YIL172C	9	18554	19153			
YIL171W	9	18915	19514			
YIL170W	9	19247	19846			
YIL169C	9	26107	26706			
SDL1	9	28432	29031			
YIL167W	9	28816	29415			
YIL166C	9	32567	33166			
YIL165C	9	34078	34677			
NIT1	9	34687	35286			
YIL163C	9	37253	37852			
SUC2	9	36785	37384			
YIL161W	9	38833	39432			
POT1	9	41445	42044			
BNR1	9	41225	41824			
YIL158W	9	45601	46200			
YIL157C	9	47543	48142			
UBP7	9	47491	48090			
GUT2	9	53709	54308			
IMP2'	9	55022	55621			
RRD1	9	54598	55197			
YIL152W	9	55945	56544			
YIL151C	9	60695	61294			
DNA43	9	62729	63328			
MLP2	9	68068	68667			
RPL40A	9	68108	68707			
SLN1	9	73454	74053			
ECM37	9	75774	76373			
PAN6	9	77392	77991			
TID3	9	77474	78073			
SSL2	9	83042	83641			
CCT2	9	82702	83301			
YIL141W	9	84453	85052			
AXL2	9	84766	85365			
REV7	9	88717	89316			
TPM2	9	89716	90315			
YIL137C	9	92789	93388			
OM45	9	93019	93618			
YIL135C	9	96376	96975			
FLX1	9	96795	97394			
RPL16A	9	99417	100016			
CSM2	9	100502	101101			
FKH1	9	102236	102835			
GIN1	9	102182	102781			
TAO3	9	113238	113837			
MET18	9	113206	113805			
YIL127C	9	117645	118244			
STH1	9	117392	117991			
KGD1	9	122089	122688			
AYR1	9	125604	126203			
SIM1	9	127551	128150			
POG1	9	130007	130606			
YIL121W	9	131641	132240			
QDR1	9	133814	134413			
RPI1	9	137875	138474			
RHO3	9	139149	139748			
PRM5	9	141567	142166			
HIS5	9	142325	142924			
NUP159	9	148707	149306			
POR2	9	149986	150585			
SDP1	9	149956	150555			
YIL112W	9	150992	151591			
COX5B	9	154619	155218			
YIL110W	9	155442	156041			
SEC24	9	160163	160762			
YIL108W	9	160284	160883			
PFK26	9	165759	166358			
MOB1	9	165812	166411			
YIL105C	9	169639	170238			
SHQ1	9	171503	172102			
YIL103W	9	171148	171747			
YIL102C	9	174885	175484			
XBP1	9	177248	177847			
YIL100W	9	176770	177369			
SGA1	9	177401	178000			
FMC1	9	180237	180836			
FYV10	9	179824	180423			
YIL096C	9	183125	183724			
PRK1	9	183334	183933			
LYS12	9	187630	188229			
RSM25	9	188782	189381			
YIL092W	9	188463	189062			
YIL091C	9	193193	193792			
YIL090W	9	192992	193591			
YIL089W	9	194996	195595			
YIL088C	9	199401	200000			
YIL087C	9	200117	200716			
YIL086C	9	200459	201058			
KTR7	9	202041	202640			
SDS3	9	203257	203856			
YIL083C	9	204651	205250			
YIL082W	9	205032	205631			
YIL082W-A	9	205032	205631			
AIR1	9	212003	212602			
THS1	9	211896	212495			
YIL077C	9	215951	216550			
SEC28	9	215866	216465			
RPN2	9	220698	221297			
SER33	9	222488	223087			
SPO22	9	225595	226194			
HOP1	9	225999	226598			
PCI8	9	229992	230591			
MAM33	9	231070	231669			
RPS24B	9	232367	232966			
SEC6	9	235472	236071			
YIL067C	9	237758	238357			
RNR3	9	240706	241305			
FIS1	9	241773	242372			
YIL064W	9	241340	241939			
YRB2	9	243742	244341			
ARC15	9	244460	245059			
SNP1	9	245557	246156			
YIL060W	9	245789	246388			
YIL058W	9	246311	246910			
YIL059C	9	246913	247512			
YIL057C	9	248394	248993			
YIL056W	9	249389	249988			
YIL055C	9	253924	254523			
FYV2	9	253941	254540			
RHR2	9	254450	255049			
RPL34B	9	257062	257661			
MMF1	9	258280	258879			
PCL7	9	258312	258911			
DFG10	9	259557	260156			
NEO1	9	260836	261435			
SYG1	9	267823	268422			
MET30	9	268050	268649			
PIG2	9	270560	271159			
AGE2	9	273846	274445			
CBR1	9	275040	275639			
YIL042C	9	276292	276891			
YIL041W	9	275924	276523			
APQ12	9	277122	277721			
YIL039W	9	277825	278424			
NOT3	9	282652	283251			
PRM2	9	284999	285598			
CST6	9	285065	285664			
CKA1	9	288908	289507			
CAP2	9	290089	290688			
BCY1	9	291669	292268			
YIL032C	9	292317	292916			
ULP2	9	292032	292631			
SSM4	9	300009	300608			
YIL029C	9	301256	301855			
YIL028W	9	301498	302097			
KRE27	9	304103	304702			
IRR1	9	307928	308527			
YIL025C	9	308574	309173			
YIL024C	9	309170	309769			
YIL023C	9	310425	311024			
TIM44	9	310563	311162			
RPB3	9	312303	312902			
HIS6	9	314819	315418			
YIL019W	9	314491	315090			
RPL2B	9	316166	316765			
VID28	9	320964	321563			
SNL1	9	320852	321451			
BAR1	9	321740	322339			
YIL014C-A	9	325525	326124			
MNT3	9	325501	326100			
PDR11	9	332441	333040			
YIL012W	9	332409	333008			
TIR3	9	333124	333723			
DOT5	9	334279	334878			
EST3	9	336210	336809			
FAA3	9	338741	339340			
URM1	9	341933	342532			
YIL007C	9	343654	344253			
YIL006W	9	343459	344058			
EPS1	9	345089	345688			
BET1	9	348503	349102			
DRE3	9	348519	349118			
INP51	9	353429	354028			
YIL001W	9	353337	353936			
SGN1	9	356893	357492			
MPH1	9	360394	360993			
YIR003W	9	360282	360881			
DJP1	9	362618	363217			
IST3	9	364286	364885			
PAN1	9	369906	370505			
YIR007W	9	370101	370700			
PRI1	9	374304	374903			
MSL1	9	373922	374521			
DSN1	9	374828	375427			
STS1	9	378244	378843			
SQT1	9	377883	378482			
GAT4	9	380382	380981			
YIR014W	9	380381	380980			
RPR2	9	381345	381944			
YIR016W	9	382025	382624			
MET28	9	384117	384716			
YAP5	9	384006	384605			
MUC1	9	393673	394272			
YIR020C	9	394555	395154			
YIR020W-B	9	394314	394913			
MRS1	9	396691	397290			
SEC11	9	398130	398729			
DAL81	9	399174	399773			
GIF1	9	403489	404088			
MND2	9	403056	403655			
YVH1	9	405965	406564			
DAL1	9	407640	408239			
DAL4	9	407865	408464			
DAL2	9	410204	410803			
DCG1	9	412768	413367			
DAL7	9	414677	415276			
DAL3	9	415615	416214			
MGA2	9	415521	416120			
LYS1	9	420734	421333			
YIR035C	9	421788	422387			
YIR036C	9	422863	423462			
HYR1	9	422525	423124			
GTT1	9	424511	425110			
YPS6	9	432108	432707			
YIR040C	9	433718	434317			
YIR041W	9	433325	433924			
YIR042C	9	435981	436580			
YIR043C	9	437733	438332			
YIR044C	9	438177	438776			
