#			
%DEFAULT_WEIGHT	1000		
#			
#Chrom	StartCoord	StopCoord	Weight

# 20bp block
1	30	50	10


# continuous two base wide weights			
1	100	101	10
1	102	103	20
1	104	105	30
1	106	107	40
1	108	109	50
1	110	111	60
1	112	113	70
1	114	115	80
1	116	117	90
1	118	119	100
			
# discontinuous two base wide weights			
1	200	201	10
1	205	206	20
1	210	211	30
1	215	216	40
1	220	221	50
1	225	226	60
1	230	231	70
			
# continuous 7 base wide weights			
1	400	406	10
1	407	413	20
1	414	420	30
1	421	427	40
1	428	434	50
1	435	441	60
1	442	448	70
			
# discontinuous 7 base wide weights			
1	500	506	10
1	510	516	20
1	520	526	30
1	530	536	40
1	540	546	50
1	550	556	60
1	560	566	70

# 20bp block
1	600	620	10


# bp  
# 6         6         6         6         
# 0         1         2         3         
# 0123456789012345678901234567890123456789
#
# ---------------------   weight = 10
#
#            ==========
# window index
#  6         6         6         6         
#  0         1         2         3         
# 90123456789012345678901234567890123456789
