{
  "responseHeader": {
    "status": 0,
    "QTime": 4,
    "params": {
      "fl": "PREFERRED_TITLE, nameRaw, THUMBNAIL_URL, public_image_text, highlighting, URI",
      "q": "",
      "wt": "json",
      "fq": "type:(*Person)",
      "rows": "10"
    }
  },
  "response": {
    "numFound": 10337,
    "start": 0,
    "docs": [
      {
        "nameRaw": [
          "Young, Kenneth",
          "\"Young, Kenneth\" "
        ],
        "THUMBNAIL_URL": "",
        "PREFERRED_TITLE": [
          "Lab Administrator"
        ],
        "URI": "https://scholars.duke.edu/individual/per7056462"
      },
      {
        "nameRaw": [
          "Lei, Zhenhuan",
          "\"Lei, Zhenhuan\" "
        ],
        "THUMBNAIL_URL": "",
        "PREFERRED_TITLE": [
          "Student"
        ],
        "URI": "https://scholars.duke.edu/individual/per9122602"
      },
      {
        "nameRaw": [
          "Huang, Jing",
          "\"Huang, Jing\" "
        ],
        "THUMBNAIL_URL": "",
        "PREFERRED_TITLE": [
          "Student"
        ],
        "URI": "https://scholars.duke.edu/individual/per4891902"
      },
      {
        "nameRaw": [
          "Kim, Jae Yun",
          "\"Kim, Jae Yun\" "
        ],
        "THUMBNAIL_URL": "",
        "PREFERRED_TITLE": [
          "Student"
        ],
        "URI": "https://scholars.duke.edu/individual/per5218302"
      },
      {
        "nameRaw": [
          "Chakraborty, Soudipta",
          "\"Chakraborty, Soudipta\" "
        ],
        "THUMBNAIL_URL": "",
        "PREFERRED_TITLE": [
          "Student"
        ],
        "URI": "https://scholars.duke.edu/individual/per4091602"
      },
      {
        "nameRaw": [
          "Moen, Rebbecca",
          "\"Moen, Rebbecca\" "
        ],
        "THUMBNAIL_URL": "",
        "PREFERRED_TITLE": [
          "Administrative Director"
        ],
        "URI": "https://scholars.duke.edu/individual/per0240162"
      },
      {
        "nameRaw": [
          "Binz, Oliver",
          "\"Binz, Oliver\" "
        ],
        "THUMBNAIL_URL": "",
        "PREFERRED_TITLE": [
          "Student"
        ],
        "URI": "https://scholars.duke.edu/individual/per3998902"
      },
      {
        "public_image_text": [
          "image_1937572.jpg"
        ],
        "nameRaw": [
          "Bielousova, Grazina",
          "\"Bielousova, Grazina\" "
        ],
        "THUMBNAIL_URL": "https://scholars.duke.edu/individual/i1937572",
        "PREFERRED_TITLE": [
          "Student"
        ],
        "URI": "https://scholars.duke.edu/individual/per1937572"
      },
      {
        "nameRaw": [
          "Thomas, Cheryl",
          "\"Thomas, Cheryl\" "
        ],
        "THUMBNAIL_URL": "",
        "PREFERRED_TITLE": [
          "Project Manager, Coll. Dev. Dept."
        ],
        "URI": "https://scholars.duke.edu/individual/per7389252"
      },
      {
        "nameRaw": [
          "Barto, Mason",
          "\"Barto, Mason\" "
        ],
        "THUMBNAIL_URL": "",
        "PREFERRED_TITLE": [
          "Student"
        ],
        "URI": "https://scholars.duke.edu/individual/per8712522"
      }
    ]
  },
  "highlighting": {
    "vitroIndividual:https://scholars.duke.edu/individual/per7056462": {},
    "vitroIndividual:https://scholars.duke.edu/individual/per9122602": {},
    "vitroIndividual:https://scholars.duke.edu/individual/per4891902": {},
    "vitroIndividual:https://scholars.duke.edu/individual/per5218302": {},
    "vitroIndividual:https://scholars.duke.edu/individual/per4091602": {},
    "vitroIndividual:https://scholars.duke.edu/individual/per0240162": {},
    "vitroIndividual:https://scholars.duke.edu/individual/per3998902": {},
    "vitroIndividual:https://scholars.duke.edu/individual/per1937572": {},
    "vitroIndividual:https://scholars.duke.edu/individual/per7389252": {},
    "vitroIndividual:https://scholars.duke.edu/individual/per8712522": {}
  }
}
