Grading at 10/21/2021:21:07:27.192769
For commit ID 0ac99dc17c41db6ce46261c8717dfae64752cf07
Grading at Thu Oct 21 17:07:08 EDT 2021
Attempting to compile:
rm -f *.o  *~ intMatrixTest
#################################################
testcase1:
Your output is correct
  - Valgrind was clean (no errors, no memory leaks)
valgrind was clean
#################################################
testcase2:
Your output is correct
  - Valgrind was clean (no errors, no memory leaks)
valgrind was clean
#################################################
testcase3:
Your output is correct
  - Valgrind was clean (no errors, no memory leaks)
valgrind was clean
#################################################
testcase4:
Your output is correct
  - Valgrind was clean (no errors, no memory leaks)
valgrind was clean
#################################################
testcase5:
Your output is correct
  - Valgrind was clean (no errors, no memory leaks)
valgrind was clean
#################################################
testcase6:
Your output is correct
  - Valgrind was clean (no errors, no memory leaks)
valgrind was clean
#################################################
testcase7:
Your output is correct
  - Valgrind was clean (no errors, no memory leaks)
valgrind was clean
#################################################
testcase8:
Your output is correct
  - Valgrind was clean (no errors, no memory leaks)
valgrind was clean
#################################################
testcase9:
Your output is correct
  - Valgrind was clean (no errors, no memory leaks)
valgrind was clean
#################################################
testcase10:
Your output is correct
  - Valgrind was clean (no errors, no memory leaks)
valgrind was clean

Overall Grade: A
