Country,Population
Brazil,212559409
China,1439323774
Germany,184467440737095550000
India,1380004385
Nigeria,206139587
Norway,5421242
South Korea,51269183
United Kingdom,67886004
United States,331002647
