Grading at 10/11/2021:22:17:54.305059
For commit ID 1544683fe0d1e57c6145f1a8c0efb4dbd717d07e
Grading at Mon Oct 11 18:17:54 EDT 2021
Your file matched the expected output
Your output matched what we expected

Overall Grade: PASSED
