Grading at 10/15/2021:23:18:46.056547
For commit ID 7549fc96f37c3c83a719e0d65ba86c2c0675ba44
Grading at Fri Oct 15 19:18:45 EDT 2021
Attempting to compile:
rm -f  point.o  main.o points *~
g++ -c -Wall -Werror -std=gnu++98 -pedantic -ggdb3 point.cpp
g++ -c -Wall -Werror -std=gnu++98 -pedantic -ggdb3 main.cpp
g++ -Wall -Werror -std=gnu++98 -pedantic -ggdb3 -o points  point.o  main.o
Your output matched what we expected

Overall Grade: PASSED
