Grading at 09/15/2021:18:42:19.727015
For commit ID cbd5d90e69a6b19040efdceb8afb3747d0b9c2ea
Grading at Wed Sep 15 14:42:19 EDT 2021
Attempting to compile arrayMax.c 
#################################################
testcase1:
Your file matched the expected output
Your output matched what we expected
Removing your main() and replacing it with our own to run more tests...
#################################################
testcase2:
array size:0 was Correct
#################################################
testcase3:
array size:1 was Correct
#################################################
testcase4:
array size:100 was Correct
#################################################
testcase5:
array size:5000 was Correct

Overall Grade: A
