Grading at 09/23/2021:05:54:29.447751
For commit ID bda0d303fb4c3f2174a146366c0d5df8c82c6cfe
Grading at Thu Sep 23 01:54:24 EDT 2021
Attempting to compile breaker.c 
gcc -Wall -Werror -std=gnu99 -pedantic -ggdb3 -c breaker.c
gcc -Wall -Werror -std=gnu99 -pedantic -ggdb3 -c arrayMax.c
gcc -o breaker breaker.o arrayMax.o
testcase1 passed
#################################################
testcase2:
testcase2 passed
#################################################
testcase3:
testcase3 passed
#################################################
testcase4:
testcase4 passed

Overall Grade: A
