Grading at 11/29/2021:19:59:14.271468
For commit ID c6a5a1286e8411a24785a15ba35eec16f9c24a3c
Grading at Mon Nov 29 14:59:14 EST 2021
Reading your quiz answers from answers.txt
Your quiz answers are correct

Overall Grade: PASSED
